{"text_format":"1","workbook":"xlsx","n_sheets":5,"sheets":["Context","Assets","Anim","Sequences","Sim"],"not_rendered":{"charts":0,"images":0,"macros":1,"external_links":0,"defined_names":1,"comments":0,"pivot_tables":0},"unopened":[],"bounds":{"document_bytes":16777216,"sheet_cells":100000,"rows_first":2000,"rows_last":500,"rows_between":2000,"halvings":0,"cell_chars":16384,"cell_head_chars":4096},"cells_cut":0,"cells_raw":0,"read":"whole","date_system":"1900"}

{"sheet":"Context","index":0,"n_rows":10,"n_cols":10,"rows_kept":10,"cut":false,"hidden":false,"merged":[]}
["JSON scene text"," "," ","{\"context\": { \"UnitOfMeasureScale\": ",",\"Zup\": ",", \"RepoPath\": \"","\"scene\": [","], \"assets\": ["," "]
["JSON animation text",{"$f":"CONCATENATE(Context!D2,B4,Context!E2,B5,Context!F2,B7,$G$2,Anim!$H$1,$H$2,Sequences!D1,$I$2)","v":"{\"context\": { \"assetTrail\": false, \"UnitOfMeasureScale\": 0.01,\"Zup\": false, \"RepoAnim\": \"\"}, \"nodes\": [], \"sequences\": [], \"bookmarks\": []}"}," ","{\"context\": { \"assetTrail\": false, \"UnitOfMeasureScale\": ",",\"Zup\": ",", \"RepoAnim\": \"","\"}, \"nodes\": [","], \"sequences\": [","], \"bookmarks\": []}"," "]
[null,null,null,null,null,null,null,null," "]
["UnitOfMeasureScale",0.01," ",null,null,null,null,null," "]
["Zup convention (true/false)","false"," ",null,null,null,null,null," "]
["repository location",null," "]
["repository animation",null," "]
[null,null," "]
[null,null," "]
[null,null," "]

{"sheet":"Assets","index":1,"n_rows":450,"n_cols":52,"rows_kept":450,"cut":false,"hidden":false,"merged":[[1,7,1,9],[1,10,1,12],[1,20,1,21],[1,22,1,23]]}
[null,null,null,null,null,null,null,null,null,null,null,null,null,null,null,null,null,null,null,null,null,null,null,null,null,null,null,null,null,null,null,null,null,""]
["id","inScene","descr","type","model","file","unit","position",null,null,"rotation",null,null,"placementRelTo","parentObject","connectedTo","assignmentTo","successors","taskTime","properties","Failure mode1",null,"Failure mode2",null,"statechart","polObserved","polThreshold","controlledMach",null,"","","","","","","","","","","","","","","","",null,null,"","",""]
[null,null,null,null,null,null,null,null,null,null,null,null,null,null,null,null,null,null,null,null,null,null,null,null,null,null,null,null,null,{"$f":"CONCATENATE(\"{\"\"\",A$2,\"\"\": \"\"\",A3,\"\"\"\")","v":"{\"id\": \"\""},{"$f":"IF(C3<>\"\",CONCATENATE(\",\"\"\",C$2,\"\"\":\"\"\",C3,\"\"\"\"),\"\")","v":""},{"$f":"IF(D3<>\"\",CONCATENATE(\",\"\"\",D$2,\"\"\":\"\"\",D3,\"\"\"\"),\"\")","v":""},{"$f":"IF(E3<>\"\",CONCATENATE(\",\"\"\",E$2,\"\"\":\"\"\",E3,\"\"\"\"),\"\")","v":""},{"$f":"IF(F3<>\"\",CONCATENATE(\",\"\"representations\"\":[{\"\"file\"\":\"\"\",F3,\"\"\",\"\"unit\"\":\",G3,\"}]\"),\"\")","v":""},{"$f":"IF(H3<>\"\",CONCATENATE(\",\"\"\",H$2,\"\"\":[\",H3,\",\",I3,\",\",J3,\"]\"),\"\")","v":""},{"$f":"IF(K3<>\"\",CONCATENATE(\",\"\"\",K$2,\"\"\":[\",K3,\",\",L3,\",\",M3,\"]\"),\"\")","v":""},{"$f":"IF(N3<>\"\",CONCATENATE(\",\"\"\",N$2,\"\"\":\"\"\",N3,\"\"\"\"),\"\")","v":""},{"$f":"IF(O3<>\"\",CONCATENATE(\",\"\"\",O$2,\"\"\":\"\"\",O3,\"\"\"\"),\"\")","v":""},{"$f":"IF(P3<>\"\",CONCATENATE(\",\"\"\",P$2,\"\"\":[\"\"\",P3,\"\"\"]\"),\"\")","v":""},{"$f":"IF(Q3<>\"\",CONCATENATE(\",\"\"\",Q$2,\"\"\":[\"\"\",Q3,\"\"\"]\"),\"\")","v":""},{"$f":"IF(R3<>\"\",CONCATENATE(\",\"\"\",R$2,\"\"\":[\"\"\",R3,\"\"\"]\"),\"\")","v":""},{"$f":"IF(S3<>\"\",CONCATENATE(\",\"\"\",S$2,\"\"\":\",S3),\"\")","v":""},{"$f":"IF(T3<>\"\",CONCATENATE(\",\"\"\",T$2,\"\"\":{\",T3,\"}\"),\"\")","v":""},{"$f":"IF(U3<>\"\",CONCATENATE(\",\"\"failureModes\"\":[{\"\"TTF\"\":\"\"\",U3,\"\"\",\"\"TTR\"\":\"\"\",V3,\"\"\"}\",IF(W3<>\"\",CONCATENATE(\",{\"\"TTF\"\":\"\"\",W3,\"\"\",\"\"TTR\"\":\"\"\",X3,\"\"\"}\",),\"\"),\"]\"),\"\")","v":""},{"$f":"IF(Y3<>\"\",CONCATENATE(\",\"\"\",Y$2,\"\"\":\",SUBSTITUTE(SUBSTITUTE(Y3, CHAR(10),\" \"), CHAR(9),\" \")),\"\")","v":""},{"$f":"IF(Z3<>\"\",CONCATENATE(\",\"\"\",Z$2,\"\"\":[\",Z3,\"]\"),\"\")","v":""},{"$f":"IF(AA3<>\"\",CONCATENATE(\",\"\"\",AA$2,\"\"\":\",AA3),\"\")","v":""},{"$f":"IF(AB3<>\"\",CONCATENATE(\",\"\"\",AB$2,\"\"\":[\",AB3,\"]\"),\"\")","v":""},"}",{"$f":"CONCATENATE(AD3,AE3,AF3,AG3,AH3,AI3,AJ3,AK3,AL3,AM3,AN3,AO3,AP3,AQ3,AR3,AS3,AT3,AU3,AV3,AW3)","v":"{\"id\": \"\"}"}," "," "]
[null,null,null,null,null,null,null,null,null,null,null,null,null,null,null,null,null,null,null,null,null,null,null,null,null,null,null,null,null,{"$f":"CONCATENATE(\"{\"\"\",A$2,\"\"\": \"\"\",A4,\"\"\"\")","v":"{\"id\": \"\""},{"$f":"IF(C4<>\"\",CONCATENATE(\",\"\"\",C$2,\"\"\":\"\"\",C4,\"\"\"\"),\"\")","v":""},{"$f":"IF(D4<>\"\",CONCATENATE(\",\"\"\",D$2,\"\"\":\"\"\",D4,\"\"\"\"),\"\")","v":""},{"$f":"IF(E4<>\"\",CONCATENATE(\",\"\"\",E$2,\"\"\":\"\"\",E4,\"\"\"\"),\"\")","v":""},{"$f":"IF(F4<>\"\",CONCATENATE(\",\"\"representations\"\":[{\"\"file\"\":\"\"\",F4,\"\"\",\"\"unit\"\":\",G4,\"}]\"),\"\")","v":""},{"$f":"IF(H4<>\"\",CONCATENATE(\",\"\"\",H$2,\"\"\":[\",H4,\",\",I4,\",\",J4,\"]\"),\"\")","v":""},{"$f":"IF(K4<>\"\",CONCATENATE(\",\"\"\",K$2,\"\"\":[\",K4,\",\",L4,\",\",M4,\"]\"),\"\")","v":""},{"$f":"IF(N4<>\"\",CONCATENATE(\",\"\"\",N$2,\"\"\":\"\"\",N4,\"\"\"\"),\"\")","v":""},{"$f":"IF(O4<>\"\",CONCATENATE(\",\"\"\",O$2,\"\"\":\"\"\",O4,\"\"\"\"),\"\")","v":""},{"$f":"IF(P4<>\"\",CONCATENATE(\",\"\"\",P$2,\"\"\":[\"\"\",P4,\"\"\"]\"),\"\")","v":""},{"$f":"IF(Q4<>\"\",CONCATENATE(\",\"\"\",Q$2,\"\"\":[\"\"\",Q4,\"\"\"]\"),\"\")","v":""},{"$f":"IF(R4<>\"\",CONCATENATE(\",\"\"\",R$2,\"\"\":[\"\"\",R4,\"\"\"]\"),\"\")","v":""},{"$f":"IF(S4<>\"\",CONCATENATE(\",\"\"\",S$2,\"\"\":\",S4),\"\")","v":""},{"$f":"IF(T4<>\"\",CONCATENATE(\",\"\"\",T$2,\"\"\":{\",T4,\"}\"),\"\")","v":""},{"$f":"IF(U4<>\"\",CONCATENATE(\",\"\"failureModes\"\":[{\"\"TTF\"\":\"\"\",U4,\"\"\",\"\"TTR\"\":\"\"\",V4,\"\"\"}\",IF(W4<>\"\",CONCATENATE(\",{\"\"TTF\"\":\"\"\",W4,\"\"\",\"\"TTR\"\":\"\"\",X4,\"\"\"}\",),\"\"),\"]\"),\"\")","v":""},{"$f":"IF(Y4<>\"\",CONCATENATE(\",\"\"\",Y$2,\"\"\":\",SUBSTITUTE(SUBSTITUTE(Y4, CHAR(10),\" \"), CHAR(9),\" \")),\"\")","v":""},{"$f":"IF(Z4<>\"\",CONCATENATE(\",\"\"\",Z$2,\"\"\":[\",Z4,\"]\"),\"\")","v":""},{"$f":"IF(AA4<>\"\",CONCATENATE(\",\"\"\",AA$2,\"\"\":\",AA4),\"\")","v":""},{"$f":"IF(AB4<>\"\",CONCATENATE(\",\"\"\",AB$2,\"\"\":[\",AB4,\"]\"),\"\")","v":""},"}",{"$f":"CONCATENATE(AD4,AE4,AF4,AG4,AH4,AI4,AJ4,AK4,AL4,AM4,AN4,AO4,AP4,AQ4,AR4,AS4,AT4,AU4,AV4,AW4)","v":"{\"id\": \"\"}"}," "]
[null,null,null,null,null,null,null,null,null,null,null,null,null,null,null,null,null,null,null,null,null,null,null,null,null,null,null,null,null,"{\"id\": \"\"","","","","","","","","","","","","","","","","","","","}","{\"id\": \"\"}"," "]
[null,null,null,null,null,null,null,null,null,null,null,null,null,null,null,null,null,null,null,null,null,null,null,null,null,null,null,null,null,"{\"id\": \"\"","","","","","","","","","","","","","","","","","","","}","{\"id\": \"\"}"," "]
[null,null,null,null,null,null,null,null,null,null,null,null,null,null,null,null,null,null,null,null,null,null,null,null,null,null,null,null,null,"{\"id\": \"\"","","","","","","","","","","","","","","","","","","","}","{\"id\": \"\"}"," "]
[null,null,null,null,null,null,null,null,null,null,null,null,null,null,null,null,null,null,null,null,null,null,null,null,null,null,null,null,null,"{\"id\": \"\"","","","","","","","","","","","","","","","","","","","}","{\"id\": \"\"}"," "]
[null,null,null,null,null,null,null,null,null,null,null,null,null,null,null,null,null,null,null,null,null,null,null,null,null,null,null,null,null,"{\"id\": \"\"","","","","","","","","","","","","","",{"$f":"IF(U9<>\"\",CONCATENATE(\",\"\"failureModes\"\":[{\"\"TTF\"\":\"\"\",U9,\"\"\",\"\"TTR\"\":\"\"\",V9,\"\"\"}\",IF(W9<>\"\",CONCATENATE(\",{\"\"TTF\"\":\"\"\",W9,\"\"\",\"\"TTR\"\":\"\"\",X9,\"\"\"}\",),\"\"),\"]\"),\"\")","v":""},"","","",{"$f":"IF(AB9<>\"\",CONCATENATE(\",\"\"\",AB$2,\"\"\":[\",AB9,\"]\"),\"\")","v":""},"}",{"$f":"CONCATENATE(AD9,AE9,AF9,AG9,AH9,AI9,AJ9,AK9,AL9,AM9,AN9,AO9,AP9,AQ9,AR9,AS9,AT9,AU9,AV9,AW9)","v":"{\"id\": \"\"}"}," "]
[null,null,null,null,null,null,null,null,null,null,null,null,null,null,null,null,null,null,null,null,null,null,null,null,null,null,null,null,null,"{\"id\": \"\"","","","","","","","","","","","","","","","","","","","}","{\"id\": \"\"}"," "]
[null,null,null,null,null,null,null,null,null,null,null,null,null,null,null,null,null,null,null,null,null,null,null,null,null,null,null,null,null,"{\"id\": \"\"","","","","","","","","","","","","","","","","","","","}","{\"id\": \"\"}"," "]
[null,null,null,null,null,null,null,null,null,null,null,null,null,null,null,null,null,null,null,null,null,null,null,null,null,null,null,null,null,"{\"id\": \"\"","","","","","","","","","","","","","","","","","","","}","{\"id\": \"\"}"," "]
[null,null,null,null,null,null,null,null,null,null,null,null,null,null,null,null,null,null,null,null,null,null,null,null,null,null,null,null,null,"{\"id\": \"\"","","","","","","","","","","","","","","","","","","","}","{\"id\": \"\"}"," "]
[null,null,null,null,null,null,null,null,null,null,null,null,null,null,null,null,null,null,null,null,null,null,null,null,null,null,null,null,null,"{\"id\": \"\"","","","","","","","","","","","","","","","","","","","}","{\"id\": \"\"}"," "]
[null,null,null,null,null,null,null,null,null,null,null,null,null,null,null,null,null,null,null,null,null,null,null,null,null,null,null,null,null,"{\"id\": \"\"","","","","","","","","","","","","","","","","","","","}","{\"id\": \"\"}"," "]
[null,null,null,null,null,null,null,null,null,null,null,null,null,null,null,null,null,null,null,null,null,null,null,null,null,null,null,null,null,"{\"id\": \"\"","","","","","","","","","","","","","","","","","","","}","{\"id\": \"\"}"," "]
[null,null,null,null,null,null,null,null,null,null,null,null,null,null,null,null,null,null,null,null,null,null,null,null,null,null,null,null,null,"{\"id\": \"\"","","","","","","","","","","","","","","","","","","","}","{\"id\": \"\"}"," "]
[null,null,null,null,null,null,null,null,null,null,null,null,null,null,null,null,null,null,null,null,null,null,null,null,null,null,null,null,null,"{\"id\": \"\"","","","","","","","","","","","","","","","","","","","}","{\"id\": \"\"}"," "]
[null,null,null,null,null,null,null,null,null,null,null,null,null,null,null,null,null,null,null,null,null,null,null,null,null,null,null,null,null,"{\"id\": \"\"","","","","","","","","","","","","","","","","","","","}","{\"id\": \"\"}"," "]
[null,null,null,null,null,null,null,null,null,null,null,null,null,null,null,null,null,null,null,null,null,null,null,null,null,null,null,null,null,"{\"id\": \"\"","","","","","","","","","","","","","","","","","","","}","{\"id\": \"\"}"," "]
[null,null,null,null,null,null,null,null,null,null,null,null,null,null,null,null,null,null,null,null,null,null,null,null,null,null,null,null,null,"{\"id\": \"\"","","","","","","","","","","","","","","","","","","","}","{\"id\": \"\"}"," "]
[null,null,null,null,null,null,null,null,null,null,null,null,null,null,null,null,null,null,null,null,null,null,null,null,null,null,null,null,null,"{\"id\": \"\"","","","","","","","","","","","","","","","","","","","}","{\"id\": \"\"}"," "]
[null,null,null,null,null,null,null,null,null,null,null,null,null,null,null,null,null,null,null,null,null,null,null,null,null,null,null,null,null,"{\"id\": \"\"","","","","","","","","","","","","","","","","","","","}","{\"id\": \"\"}"," "]
[null,null,null,null,null,null,null,null,null,null,null,null,null,null,null,null,null,null,null,null,null,null,null,null,null,null,null,null,null,"{\"id\": \"\"","","","","","","","","","","","","","","","","","","","}","{\"id\": \"\"}"," "]
[null,null,null,null,null,null,null,null,null,null,null,null,null,null,null,null,null,null,null,null,null,null,null,null,null,null,null,null,null,"{\"id\": \"\"","","","","","","","","","","","","","","","","","","","}","{\"id\": \"\"}"," "]
[null,null,null,null,null,null,null,null,null,null,null,null,null,null,null,null,null,null,null,null,null,null,null,null,null,null,null,null,null,"{\"id\": \"\"","","","","","","","","","","","","","","","","","","","}","{\"id\": \"\"}"," "]
[null,null,null,null,null,null,null,null,null,null,null,null,null,null,null,null,null,null,null,null,null,null,null,null,null,null,null,null,null,"{\"id\": \"\"","","","","","","","","","","","","","","","","","","","}","{\"id\": \"\"}"," "]
[null,null,null,null,null,null,null,null,null,null,null,null,null,null,null,null,null,null,null,null,null,null,null,null,null,null,null,null,null,"{\"id\": \"\"","","","","","","","","","","","","","","","","","","","}","{\"id\": \"\"}"," "]
[null,null,null,null,null,null,null,null,null,null,null,null,null,null,null,null,null,null,null,null,null,null,null,null,null,null,null,null,null,"{\"id\": \"\"","","","","","","","","","","","","","","","","","","","}","{\"id\": \"\"}"," "]
[null,null,null,null,null,null,null,null,null,null,null,null,null,null,null,null,null,null,null,null,null,null,null,null,null,null,null,null,null,"{\"id\": \"\"","","","","","","","","","","","","","","","","","","","}","{\"id\": \"\"}"," "]
[null,null,null,null,null,null,null,null,null,null,null,null,null,null,null,null,null,null,null,null,null,null,null,null,null,null,null,null,null,"{\"id\": \"\"","","","","","","","","","","","","","","","","","","","}","{\"id\": \"\"}"," "]
[null,null,null,null,null,null,null,null,null,null,null,null,null,null,null,null,null,null,null,null,null,null,null,null,null,null,null,null,null,"{\"id\": \"\"","","","","","","","","","","","","","","","","","","","}","{\"id\": \"\"}"," "]
[null,null,null,null,null,null,null,null,null,null,null,null,null,null,null,null,null,null,null,null,null,null,null,null,null,null,null,null,null,"{\"id\": \"\"","","","","","","","","","","","","","","","","","","","}","{\"id\": \"\"}"," "]
[null,null,null,null,null,null,null,null,null,null,null,null,null,null,null,null,null,null,null,null,null,null,null,null,null,null,null,null,null,"{\"id\": \"\"","","","","","","","","","","","","","","","","","","","}","{\"id\": \"\"}"," "]
[null,null,null,null,null,null,null,null,null,null,null,null,null,null,null,null,null,null,null,null,null,null,null,null,null,null,null,null,null,"{\"id\": \"\"","","","","","","","","","","","","","","","","","","","}","{\"id\": \"\"}"," "]
[null,null,null,null,null,null,null,null,null,null,null,null,null,null,null,null,null,null,null,null,null,null,null,null,null,null,null,null,null,"{\"id\": \"\"","","","","","","","","","","","","","","","","","","","}","{\"id\": \"\"}"," "]
[null,null,null,null,null,null,null,null,null,null,null,null,null,null,null,null,null,null,null,null,null,null,null,null,null,null,null,null,null,"{\"id\": \"\"","","","","","","","","","","","","","","","","","","","}","{\"id\": \"\"}"," "]
[null,null,null,null,null,null,null,null,null,null,null,null,null,null,null,null,null,null,null,null,null,null,null,null,null,null,null,null,null,"{\"id\": \"\"","","","","","","","","","","","","","","","","","","","}","{\"id\": \"\"}"," "]
[null,null,null,null,null,null,null,null,null,null,null,null,null,null,null,null,null,null,null,null,null,null,null,null,null,null,null,null,null,"{\"id\": \"\"","","","","","","","","","","","","","","","","","","","}","{\"id\": \"\"}"," "]
[null,null,null,null,null,null,null,null,null,null,null,null,null,null,null,null,null,null,null,null,null,null,null,null,null,null,null,null,null,"{\"id\": \"\"","","","","","","","","","","","","","","","","","","","}","{\"id\": \"\"}"," "]
[null,null,null,null,null,null,null,null,null,null,null,null,null,null,null,null,null,null,null,null,null,null,null,null,null,null,null,null,null,"{\"id\": \"\"","","","","","","","","","","","","","","","","","","","}","{\"id\": \"\"}"," "]
[null,null,null,null,null,null,null,null,null,null,null,null,null,null,null,null,null,null,null,null,null,null,null,null,null,null,null,null,null,"{\"id\": \"\"","","","","","","","","","","","","","","","","","","","}","{\"id\": \"\"}"," "]
[null,null,null,null,null,null,null,null,null,null,null,null,null,null,null,null,null,null,null,null,null,null,null,null,null,null,null,null,null,"{\"id\": \"\"","","","","","","","","","","","","","","","","","","","}","{\"id\": \"\"}"," "]
[null,null,null,null,null,null,null,null,null,null,null,null,null,null,null,null,null,null,null,null,null,null,null,null,null,null,null,null,null,"{\"id\": \"\"","","","","","","","","","","","","","","","","","","","}","{\"id\": \"\"}"," "]
[null,null,null,null,null,null,null,null,null,null,null,null,null,null,null,null,null,null,null,null,null,null,null,null,null,null,null,null,null,"{\"id\": \"\"","","","","","","","","","","","","","","","","","","","}","{\"id\": \"\"}"," "]
[null,null,null,null,null,null,null,null,null,null,null,null,null,null,null,null,null,null,null,null,null,null,null,null,null,null,null,null,null,"{\"id\": \"\"","","","","","","","","","","","","","","","","","","","}","{\"id\": \"\"}"," "]
[null,null,null,null,null,null,null,null,null,null,null,null,null,null,null,null,null,null,null,null,null,null,null,null,null,null,null,null,null,"{\"id\": \"\"","","","","","","","","","","","","","","","","","","","}","{\"id\": \"\"}"," "]
[null,null,null,null,null,null,null,null,null,null,null,null,null,null,null,null,null,null,null,null,null,null,null,null,null,null,null,null,null,"{\"id\": \"\"","","","","","","","","","","","","","","","","","","","}","{\"id\": \"\"}"," "]
[null,null,null,null,null,null,null,null,null,null,null,null,null,null,null,null,null,null,null,null,null,null,null,null,null,null,null,null,null,"{\"id\": \"\"","","","","","","","","","","","","","","","","","","","}","{\"id\": \"\"}"," "]
[null,null,null,null,null,null,null,null,null,null,null,null,null,null,null,null,null,null,null,null,null,null,null,null,null,null,null,null,null,"{\"id\": \"\"","","","","","","","","","","","","","","","","","","","}","{\"id\": \"\"}"," "]
[null,null,null,null,null,null,null,null,null,null,null,null,null,null,null,null,null,null,null,null,null,null,null,null,null,null,null,null,null,"{\"id\": \"\"","","","","","","","","","","","","","","","","","","","}","{\"id\": \"\"}"," "]
[null,null,null,null,null,null,null,null,null,null,null,null,null,null,null,null,null,null,null,null,null,null,null,null,null,null,null,null,null,"{\"id\": \"\"","","","","","","","","","","","","","","","","","","","}","{\"id\": \"\"}"," "]
[null,null,null,null,null,null,null,null,null,null,null,null,null,null,null,null,null,null,null,null,null,null,null,null,null,null,null,null,null,"{\"id\": \"\"","","","","","","","","","","","","","","","","","","","}","{\"id\": \"\"}"," "]
[null,null,null,null,null,null,null,null,null,null,null,null,null,null,null,null,null,null,null,null,null,null,null,null,null,null,null,null,null,"{\"id\": \"\"","","","","","","","","","","","","","","","","","","","}","{\"id\": \"\"}"," "]
[null,null,null,null,null,null,null,null,null,null,null,null,null,null,null,null,null,null,null,null,null,null,null,null,null,null,null,null,null,"{\"id\": \"\"","","","","","","","","","","","","","","","","","","","}","{\"id\": \"\"}"," "]
[null,null,null,null,null,null,null,null,null,null,null,null,null,null,null,null,null,null,null,null,null,null,null,null,null,null,null,null,null,"{\"id\": \"\"","","","","","","","","","","","","","","","","","","","}","{\"id\": \"\"}"," "]
[null,null,null,null,null,null,null,null,null,null,null,null,null,null,null,null,null,null,null,null,null,null,null,null,null,null,null,null,null,"{\"id\": \"\"","","","","","","","","","","","","","","","","","","","}","{\"id\": \"\"}"," "]
[null,null,null,null,null,null,null,null,null,null,null,null,null,null,null,null,null,null,null,null,null,null,null,null,null,null,null,null,null,"{\"id\": \"\"","","","","","","","","","","","","","","","","","","","}","{\"id\": \"\"}"," "]
[null,null,null,null,null,null,null,null,null,null,null,null,null,null,null,null,null,null,null,null,null,null,null,null,null,null,null,null,null,"{\"id\": \"\"","","","","","","","","","","","","","","","","","","","}","{\"id\": \"\"}"," "]
[null,null,null,null,null,null,null,null,null,null,null,null,null,null,null,null,null,null,null,null,null,null,null,null,null,null,null,null,null,"{\"id\": \"\"","","","","","","","","","","","","","","","","","","","}","{\"id\": \"\"}"," "]
[null,null,null,null,null,null,null,null,null,null,null,null,null,null,null,null,null,null,null,null,null,null,null,null,null,null,null,null,null,"{\"id\": \"\"","","","","","","","","","","","","","","","","","","","}","{\"id\": \"\"}"," "]
[null,null,null,null,null,null,null,null,null,null,null,null,null,null,null,null,null,null,null,null,null,null,null,null,null,null,null,null,null,"{\"id\": \"\"","","","","","","","","","","","","","","","","","","","}","{\"id\": \"\"}"," "]
[null,null,null,null,null,null,null,null,null,null,null,null,null,null,null,null,null,null,null,null,null,null,null,null,null,null,null,null,null,"{\"id\": \"\"","","","","","","","","","","","","","","","","","","","}","{\"id\": \"\"}"," "]
[null,null,null,null,null,null,null,null,null,null,null,null,null,null,null,null,null,null,null,null,null,null,null,null,null,null,null,null,null,"{\"id\": \"\"","","","","","","","","","","","","","","","","","","","}","{\"id\": \"\"}"," "]
[null,null,null,null,null,null,null,null,null,null,null,null,null,null,null,null,null,null,null,null,null,null,null,null,null,null,null,null,null,"{\"id\": \"\"","","","","","","","","","","","","","","","","","","","}","{\"id\": \"\"}"," "]
[null,null,null,null,null,null,null,null,null,null,null,null,null,null,null,null,null,null,null,null,null,null,null,null,null,null,null,null,null,"{\"id\": \"\"","","","","","","","","","","","","","","","","","","","}","{\"id\": \"\"}"," "]
[null,null,null,null,null,null,null,null,null,null,null,null,null,null,null,null,null,null,null,null,null,null,null,null,null,null,null,null,null,"{\"id\": \"\"","","","","","","","","","","","","","","","","","","","}","{\"id\": \"\"}"," "]
[null,null,null,null,null,null,null,null,null,null,null,null,null,null,null,null,null,null,null,null,null,null,null,null,null,null,null,null,null,{"$f":"CONCATENATE(\"{\"\"\",A$2,\"\"\": \"\"\",A68,\"\"\"\")","v":"{\"id\": \"\""},{"$f":"IF(C68<>\"\",CONCATENATE(\",\"\"\",C$2,\"\"\":\"\"\",C68,\"\"\"\"),\"\")","v":""},{"$f":"IF(D68<>\"\",CONCATENATE(\",\"\"\",D$2,\"\"\":\"\"\",D68,\"\"\"\"),\"\")","v":""},{"$f":"IF(E68<>\"\",CONCATENATE(\",\"\"\",E$2,\"\"\":\"\"\",E68,\"\"\"\"),\"\")","v":""},{"$f":"IF(F68<>\"\",CONCATENATE(\",\"\"representations\"\":[{\"\"file\"\":\"\"\",F68,\"\"\",\"\"unit\"\":\",G68,\"}]\"),\"\")","v":""},{"$f":"IF(H68<>\"\",CONCATENATE(\",\"\"\",H$2,\"\"\":[\",H68,\",\",I68,\",\",J68,\"]\"),\"\")","v":""},{"$f":"IF(K68<>\"\",CONCATENATE(\",\"\"\",K$2,\"\"\":[\",K68,\",\",L68,\",\",M68,\"]\"),\"\")","v":""},{"$f":"IF(N68<>\"\",CONCATENATE(\",\"\"\",N$2,\"\"\":\"\"\",N68,\"\"\"\"),\"\")","v":""},{"$f":"IF(O68<>\"\",CONCATENATE(\",\"\"\",O$2,\"\"\":\"\"\",O68,\"\"\"\"),\"\")","v":""},{"$f":"IF(P68<>\"\",CONCATENATE(\",\"\"\",P$2,\"\"\":[\"\"\",P68,\"\"\"]\"),\"\")","v":""},{"$f":"IF(Q68<>\"\",CONCATENATE(\",\"\"\",Q$2,\"\"\":[\"\"\",Q68,\"\"\"]\"),\"\")","v":""},{"$f":"IF(R68<>\"\",CONCATENATE(\",\"\"\",R$2,\"\"\":[\"\"\",R68,\"\"\"]\"),\"\")","v":""},{"$f":"IF(S68<>\"\",CONCATENATE(\",\"\"\",S$2,\"\"\":\",S68),\"\")","v":""},{"$f":"IF(T68<>\"\",CONCATENATE(\",\"\"\",T$2,\"\"\":{\",T68,\"}\"),\"\")","v":""},{"$f":"IF(U68<>\"\",CONCATENATE(\",\"\"failureModes\"\":[{\"\"TTF\"\":\"\"\",U68,\"\"\",\"\"TTR\"\":\"\"\",V68,\"\"\"}\",IF(W68<>\"\",CONCATENATE(\",{\"\"TTF\"\":\"\"\",W68,\"\"\",\"\"TTR\"\":\"\"\",X68,\"\"\"}\",),\"\"),\"]\"),\"\")","v":""},{"$f":"IF(Y68<>\"\",CONCATENATE(\",\"\"\",Y$2,\"\"\":\",SUBSTITUTE(SUBSTITUTE(Y68, CHAR(10),\" \"), CHAR(9),\" \")),\"\")","v":""},{"$f":"IF(Z68<>\"\",CONCATENATE(\",\"\"\",Z$2,\"\"\":[\",Z68,\"]\"),\"\")","v":""},{"$f":"IF(AA68<>\"\",CONCATENATE(\",\"\"\",AA$2,\"\"\":\",AA68),\"\")","v":""},{"$f":"IF(AB68<>\"\",CONCATENATE(\",\"\"\",AB$2,\"\"\":[\",AB68,\"]\"),\"\")","v":""},"}",{"$f":"CONCATENATE(AD68,AE68,AF68,AG68,AH68,AI68,AJ68,AK68,AL68,AM68,AN68,AO68,AP68,AQ68,AR68,AS68,AT68,AU68,AV68,AW68)","v":"{\"id\": \"\"}"}," "]
[null,null,null,null,null,null,null,null,null,null,null,null,null,null,null,null,null,null,null,null,null,null,null,null,null,null,null,null,null,"{\"id\": \"\"","","","","","","","","","","","","","","","","","","","}","{\"id\": \"\"}"," "]
[null,null,null,null,null,null,null,null,null,null,null,null,null,null,null,null,null,null,null,null,null,null,null,null,null,null,null,null,null,"{\"id\": \"\"","","","","","","","","","","","","","","","","","","","}","{\"id\": \"\"}"," "]
[null,null,null,null,null,null,null,null,null,null,null,null,null,null,null,null,null,null,null,null,null,null,null,null,null,null,null,null,null,"{\"id\": \"\"","","","","","","","","","","","","","","","","","","","}","{\"id\": \"\"}"," "]
[null,null,null,null,null,null,null,null,null,null,null,null,null,null,null,null,null,null,null,null,null,null,null,null,null,null,null,null,null,"{\"id\": \"\"","","","","","","","","","","","","","","","","","","","}","{\"id\": \"\"}"," "]
[null,null,null,null,null,null,null,null,null,null,null,null,null,null,null,null,null,null,null,null,null,null,null,null,null,null,null,null,null,"{\"id\": \"\"","","","","","","","","","","","","","","","","","","","}","{\"id\": \"\"}"," "]
[null,null,null,null,null,null,null,null,null,null,null,null,null,null,null,null,null,null,null,null,null,null,null,null,null,null,null,null,null,{"$f":"CONCATENATE(\"{\"\"\",A$2,\"\"\": \"\"\",A74,\"\"\"\")","v":"{\"id\": \"\""},{"$f":"IF(C74<>\"\",CONCATENATE(\",\"\"\",C$2,\"\"\":\"\"\",C74,\"\"\"\"),\"\")","v":""},{"$f":"IF(D74<>\"\",CONCATENATE(\",\"\"\",D$2,\"\"\":\"\"\",D74,\"\"\"\"),\"\")","v":""},{"$f":"IF(E74<>\"\",CONCATENATE(\",\"\"\",E$2,\"\"\":\"\"\",E74,\"\"\"\"),\"\")","v":""},{"$f":"IF(F74<>\"\",CONCATENATE(\",\"\"representations\"\":[{\"\"file\"\":\"\"\",F74,\"\"\",\"\"unit\"\":\",G74,\"}]\"),\"\")","v":""},{"$f":"IF(H74<>\"\",CONCATENATE(\",\"\"\",H$2,\"\"\":[\",H74,\",\",I74,\",\",J74,\"]\"),\"\")","v":""},{"$f":"IF(K74<>\"\",CONCATENATE(\",\"\"\",K$2,\"\"\":[\",K74,\",\",L74,\",\",M74,\"]\"),\"\")","v":""},{"$f":"IF(N74<>\"\",CONCATENATE(\",\"\"\",N$2,\"\"\":\"\"\",N74,\"\"\"\"),\"\")","v":""},{"$f":"IF(O74<>\"\",CONCATENATE(\",\"\"\",O$2,\"\"\":\"\"\",O74,\"\"\"\"),\"\")","v":""},{"$f":"IF(P74<>\"\",CONCATENATE(\",\"\"\",P$2,\"\"\":[\"\"\",P74,\"\"\"]\"),\"\")","v":""},{"$f":"IF(Q74<>\"\",CONCATENATE(\",\"\"\",Q$2,\"\"\":[\"\"\",Q74,\"\"\"]\"),\"\")","v":""},{"$f":"IF(R74<>\"\",CONCATENATE(\",\"\"\",R$2,\"\"\":[\"\"\",R74,\"\"\"]\"),\"\")","v":""},{"$f":"IF(S74<>\"\",CONCATENATE(\",\"\"\",S$2,\"\"\":\",S74),\"\")","v":""},{"$f":"IF(T74<>\"\",CONCATENATE(\",\"\"\",T$2,\"\"\":{\",T74,\"}\"),\"\")","v":""},{"$f":"IF(U74<>\"\",CONCATENATE(\",\"\"failureModes\"\":[{\"\"TTF\"\":\"\"\",U74,\"\"\",\"\"TTR\"\":\"\"\",V74,\"\"\"}\",IF(W74<>\"\",CONCATENATE(\",{\"\"TTF\"\":\"\"\",W74,\"\"\",\"\"TTR\"\":\"\"\",X74,\"\"\"}\",),\"\"),\"]\"),\"\")","v":""},{"$f":"IF(Y74<>\"\",CONCATENATE(\",\"\"\",Y$2,\"\"\":\",SUBSTITUTE(SUBSTITUTE(Y74, CHAR(10),\" \"), CHAR(9),\" \")),\"\")","v":""},{"$f":"IF(Z74<>\"\",CONCATENATE(\",\"\"\",Z$2,\"\"\":[\",Z74,\"]\"),\"\")","v":""},{"$f":"IF(AA74<>\"\",CONCATENATE(\",\"\"\",AA$2,\"\"\":\",AA74),\"\")","v":""},{"$f":"IF(AB74<>\"\",CONCATENATE(\",\"\"\",AB$2,\"\"\":[\",AB74,\"]\"),\"\")","v":""},"}",{"$f":"CONCATENATE(AD74,AE74,AF74,AG74,AH74,AI74,AJ74,AK74,AL74,AM74,AN74,AO74,AP74,AQ74,AR74,AS74,AT74,AU74,AV74,AW74)","v":"{\"id\": \"\"}"}," "]
[null,null,null,null,null,null,null,null,null,null,null,null,null,null,null,null,null,null,null,null,null,null,null,null,null,null,null,null,null,"{\"id\": \"\"","","","","","","","","","","","","","","","","","","","}","{\"id\": \"\"}"," "]
[null,null,null,null,null,null,null,null,null,null,null,null,null,null,null,null,null,null,null,null,null,null,null,null,null,null,null,null,null,"{\"id\": \"\"","","","","","","","","","","","","","","","","","","","}","{\"id\": \"\"}"," "]
[null,null,null,null,null,null,null,null,null,null,null,null,null,null,null,null,null,null,null,null,null,null,null,null,null,null,null,null,null,"{\"id\": \"\"","","","","","","","","","","","","","","","","","","","}","{\"id\": \"\"}"," "]
[null,null,null,null,null,null,null,null,null,null,null,null,null,null,null,null,null,null,null,null,null,null,null,null,null,null,null,null,null,"{\"id\": \"\"","","","","","","","","","","","","","","","","","","","}","{\"id\": \"\"}"," "]
[null,null,null,null,null,null,null,null,null,null,null,null,null,null,null,null,null,null,null,null,null,null,null,null,null,null,null,null,null,"{\"id\": \"\"","","","","","","","","","","","","","","","","","","","}","{\"id\": \"\"}"," "]
[null,null,null,null,null,null,null,null,null,null,null,null,null,null,null,null,null,null,null,null,null,null,null,null,null,null,null,null,null,"{\"id\": \"\"","","","","","","","","","","","","","","","","","","","}","{\"id\": \"\"}"," "]
[null,null,null,null,null,null,null,null,null,null,null,null,null,null,null,null,null,null,null,null,null,null,null,null,null,null,null,null,null,"{\"id\": \"\"","","","","","","","","","","","","","","","","","","","}","{\"id\": \"\"}"," "]
[null,null,null,null,null,null,null,null,null,null,null,null,null,null,null,null,null,null,null,null,null,null,null,null,null,null,null,null,null,"{\"id\": \"\"","","","","","","","","","","","","","","","","","","","}","{\"id\": \"\"}"," "]
[null,null,null,null,null,null,null,null,null,null,null,null,null,null,null,null,null,null,null,null,null,null,null,null,null,null,null,null,null,"{\"id\": \"\"","","","","","","","","","","","","","","","","","","","}","{\"id\": \"\"}"," "]
[null,null,null,null,null,null,null,null,null,null,null,null,null,null,null,null,null,null,null,null,null,null,null,null,null,null,null,null,null,"{\"id\": \"\"","","","","","","","","","","","","","","","","","","","}","{\"id\": \"\"}"," "]
[null,null,null,null,null,null,null,null,null,null,null,null,null,null,null,null,null,null,null,null,null,null,null,null,null,null,null,null,null,"{\"id\": \"\"","","","","","","","","","","","","","","","","","","","}","{\"id\": \"\"}"," "]
[null,null,null,null,null,null,null,null,null,null,null,null,null,null,null,null,null,null,null,null,null,null,null,null,null,null,null,null,null,"{\"id\": \"\"","","","","","","","","","","","","","","","","","","","}","{\"id\": \"\"}"," "]
[null,null,null,null,null,null,null,null,null,null,null,null,null,null,null,null,null,null,null,null,null,null,null,null,null,null,null,null,null,"{\"id\": \"\"","","","","","","","","","","","","","","","","","","","}","{\"id\": \"\"}"," "]
[null,null,null,null,null,null,null,null,null,null,null,null,null,null,null,null,null,null,null,null,null,null,null,null,null,null,null,null,null,"{\"id\": \"\"","","","","","","","","","","","","","","","","","","","}","{\"id\": \"\"}"," "]
[null,null,null,null,null,null,null,null,null,null,null,null,null,null,null,null,null,null,null,null,null,null,null,null,null,null,null,null,null,"{\"id\": \"\"","","","","","","","","","","","","","","","","","","","}","{\"id\": \"\"}"," "]
[null,null,null,null,null,null,null,null,null,null,null,null,null,null,null,null,null,null,null,null,null,null,null,null,null,null,null,null,null,"{\"id\": \"\"","","","","","","","","","","","","","","","","","","","}","{\"id\": \"\"}"," "]
[null,null,null,null,null,null,null,null,null,null,null,null,null,null,null,null,null,null,null,null,null,null,null,null,null,null,null,null,null,"{\"id\": \"\"","","","","","","","","","","","","","","","","","","","}","{\"id\": \"\"}"," "]
[null,null,null,null,null,null,null,null,null,null,null,null,null,null,null,null,null,null,null,null,null,null,null,null,null,null,null,null,null,"{\"id\": \"\"","","","","","","","","","","","","","","","","","","","}","{\"id\": \"\"}"," "]
[null,null,null,null,null,null,null,null,null,null,null,null,null,null,null,null,null,null,null,null,null,null,null,null,null,null,null,null,null,"{\"id\": \"\"","","","","","","","","","","","","","","","","","","","}","{\"id\": \"\"}"," "]
[null,null,null,null,null,null,null,null,null,null,null,null,null,null,null,null,null,null,null,null,null,null,null,null,null,null,null,null,null,"{\"id\": \"\"","","","","","","","","","","","","","","","","","","","}","{\"id\": \"\"}"," "]
[null,null,null,null,null,null,null,null,null,null,null,null,null,null,null,null,null,null,null,null,null,null,null,null,null,null,null,null,null,"{\"id\": \"\"","","","","","","","","","","","","","","","","","","","}","{\"id\": \"\"}"," "]
[null,null,null,null,null,null,null,null,null,null,null,null,null,null,null,null,null,null,null,null,null,null,null,null,null,null,null,null,null,"{\"id\": \"\"","","","","","","","","","","","","","","","","","","","}","{\"id\": \"\"}"," "]
[null,null,null,null,null,null,null,null,null,null,null,null,null,null,null,null,null,null,null,null,null,null,null,null,null,null,null,null,null,"{\"id\": \"\"","","","","","","","","","","","","","","","","","","","}","{\"id\": \"\"}"," "]
[null,null,null,null,null,null,null,null,null,null,null,null,null,null,null,null,null,null,null,null,null,null,null,null,null,null,null,null,null,"{\"id\": \"\"","","","","","","","","","","","","","","","","","","","}","{\"id\": \"\"}"," "]
[null,null,null,null,null,null,null,null,null,null,null,null,null,null,null,null,null,null,null,null,null,null,null,null,null,null,null,null,null,"{\"id\": \"\"","","","","","","","","","","","","","","","","","","","}","{\"id\": \"\"}"," "]
[null,null,null,null,null,null,null,null,null,null,null,null,null,null,null,null,null,null,null,null,null,null,null,null,null,null,null,null,null,"{\"id\": \"\"","","","","","","","","","","","","","","","","","","","}","{\"id\": \"\"}"," "]
[null,null,null,null,null,null,null,null,null,null,null,null,null,null,null,null,null,null,null,null,null,null,null,null,null,null,null,null,null,"{\"id\": \"\"","","","","","","","","","","","","","","","","","","","}","{\"id\": \"\"}"," "]
[null,null,null,null,null,null,null,null,null,null,null,null,null,null,null,null,null,null,null,null,null,null,null,null,null,null,null,null,null,"{\"id\": \"\"","","","","","","","","","","","","","","","","","","","}","{\"id\": \"\"}"," "]
[null,null,null,null,null,null,null,null,null,null,null,null,null,null,null,null,null,null,null,null,null,null,null,null,null,null,null,null,null,"{\"id\": \"\"","","","","","","","","","","","","","","","","","","","}","{\"id\": \"\"}"," "]
[null,null,null,null,null,null,null,null,null,null,null,null,null,null,null,null,null,null,null,null,null,null,null,null,null,null,null,null,null,"{\"id\": \"\"","","","","","","","","","","","","","","","","","","","}","{\"id\": \"\"}"," "]
[null,null,null,null,null,null,null,null,null,null,null,null,null,null,null,null,null,null,null,null,null,null,null,null,null,null,null,null,null,"{\"id\": \"\"","","","","","","","","","","","","","","","","","","","}","{\"id\": \"\"}"," "]
[null,null,null,null,null,null,null,null,null,null,null,null,null,null,null,null,null,null,null,null,null,null,null,null,null,null,null,null,null,"{\"id\": \"\"","","","","","","","","","","","","","","","","","","","}","{\"id\": \"\"}"," "]
[null,null,null,null,null,null,null,null,null,null,null,null,null,null,null,null,null,null,null,null,null,null,null,null,null,null,null,null,null,"{\"id\": \"\"","","","","","","","","","","","","","","","","","","","}","{\"id\": \"\"}"," "]
[null,null,null,null,null,null,null,null,null,null,null,null,null,null,null,null,null,null,null,null,null,null,null,null,null,null,null,null,null,"{\"id\": \"\"","","","","","","","","","","","","","","","","","","","}","{\"id\": \"\"}"," "]
[null,null,null,null,null,null,null,null,null,null,null,null,null,null,null,null,null,null,null,null,null,null,null,null,null,null,null,null,null,"{\"id\": \"\"","","","","","","","","","","","","","","","","","","","}","{\"id\": \"\"}"," "]
[null,null,null,null,null,null,null,null,null,null,null,null,null,null,null,null,null,null,null,null,null,null,null,null,null,null,null,null,null,"{\"id\": \"\"","","","","","","","","","","","","","","","","","","","}","{\"id\": \"\"}"," "]
[null,null,null,null,null,null,null,null,null,null,null,null,null,null,null,null,null,null,null,null,null,null,null,null,null,null,null,null,null,"{\"id\": \"\"","","","","","","","","","","","","","","","","","","","}","{\"id\": \"\"}"," "]
[null,null,null,null,null,null,null,null,null,null,null,null,null,null,null,null,null,null,null,null,null,null,null,null,null,null,null,null,null,"{\"id\": \"\"","","","","","","","","","","","","","","","","","","","}","{\"id\": \"\"}"," "]
[null,null,null,null,null,null,null,null,null,null,null,null,null,null,null,null,null,null,null,null,null,null,null,null,null,null,null,null,null,"{\"id\": \"\"","","","","","","","","","","","","","","","","","","","}","{\"id\": \"\"}"," "]
[null,null,null,null,null,null,null,null,null,null,null,null,null,null,null,null,null,null,null,null,null,null,null,null,null,null,null,null,null,"{\"id\": \"\"","","","","","","","","","","","","","","","","","","","}","{\"id\": \"\"}"," "]
[null,null,null,null,null,null,null,null,null,null,null,null,null,null,null,null,null,null,null,null,null,null,null,null,null,null,null,null,null,"{\"id\": \"\"","","","","","","","","","","","","","","","","","","","}","{\"id\": \"\"}"," "]
[null,null,null,null,null,null,null,null,null,null,null,null,null,null,null,null,null,null,null,null,null,null,null,null,null,null,null,null,null,"{\"id\": \"\"","","","","","","","","","","","","","","","","","","","}","{\"id\": \"\"}"," "]
[null,null,null,null,null,null,null,null,null,null,null,null,null,null,null,null,null,null,null,null,null,null,null,null,null,null,null,null,null,"{\"id\": \"\"","","","","","","","","","","","","","","","","","","","}","{\"id\": \"\"}"," "]
[null,null,null,null,null,null,null,null,null,null,null,null,null,null,null,null,null,null,null,null,null,null,null,null,null,null,null,null,null,"{\"id\": \"\"","","","","","","","","","","","","","","","","","","","}","{\"id\": \"\"}"," "]
[null,null,null,null,null,null,null,null,null,null,null,null,null,null,null,null,null,null,null,null,null,null,null,null,null,null,null,null,null,"{\"id\": \"\"","","","","","","","","","","","","","","","","","","","}","{\"id\": \"\"}"," "]
[null,null,null,null,null,null,null,null,null,null,null,null,null,null,null,null,null,null,null,null,null,null,null,null,null,null,null,null,null,"{\"id\": \"\"","","","","","","","","","","","","","","","","","","","}","{\"id\": \"\"}"," "]
[null,null,null,null,null,null,null,null,null,null,null,null,null,null,null,null,null,null,null,null,null,null,null,null,null,null,null,null,null,"{\"id\": \"\"","","","","","","","","","","","","","","","","","","","}","{\"id\": \"\"}"," "]
[null,null,null,null,null,null,null,null,null,null,null,null,null,null,null,null,null,null,null,null,null,null,null,null,null,null,null,null,null,"{\"id\": \"\"","","","","","","","","","","","","","","","","","","","}","{\"id\": \"\"}"," "]
[null,null,null,null,null,null,null,null,null,null,null,null,null,null,null,null,null,null,null,null,null,null,null,null,null,null,null,null,null,"{\"id\": \"\"","","","","","","","","","","","","","","","","","","","}","{\"id\": \"\"}"," "]
[null,null,null,null,null,null,null,null,null,null,null,null,null,null,null,null,null,null,null,null,null,null,null,null,null,null,null,null,null,"{\"id\": \"\"","","","","","","","","","","","","","","","","","","","}","{\"id\": \"\"}"," "]
[null,null,null,null,null,null,null,null,null,null,null,null,null,null,null,null,null,null,null,null,null,null,null,null,null,null,null,null,null,"{\"id\": \"\"","","","","","","","","","","","","","","","","","","","}","{\"id\": \"\"}"," "]
[null,null,null,null,null,null,null,null,null,null,null,null,null,null,null,null,null,null,null,null,null,null,null,null,null,null,null,null,null,"{\"id\": \"\"","","","","","","","","","","","","","","","","","","","}","{\"id\": \"\"}"," "]
[null,null,null,null,null,null,null,null,null,null,null,null,null,null,null,null,null,null,null,null,null,null,null,null,null,null,null,null,null,"{\"id\": \"\"","","","","","","","","","","","","","","","","","","","}","{\"id\": \"\"}"," "]
[null,null,null,null,null,null,null,null,null,null,null,null,null,null,null,null,null,null,null,null,null,null,null,null,null,null,null,null,null,"{\"id\": \"\"","","","","","","","","","","","","","","","","","","","}","{\"id\": \"\"}"," "]
[null,null,null,null,null,null,null,null,null,null,null,null,null,null,null,null,null,null,null,null,null,null,null,null,null,null,null,null,null,"{\"id\": \"\"","","","","","","","","","","","","","","","","","","","}","{\"id\": \"\"}"," "]
[null,null,null,null,null,null,null,null,null,null,null,null,null,null,null,null,null,null,null,null,null,null,null,null,null,null,null,null,null,"{\"id\": \"\"","","","","","","","","","","","","","","","","","","","}","{\"id\": \"\"}"," "]
[null,null,null,null,null,null,null,null,null,null,null,null,null,null,null,null,null,null,null,null,null,null,null,null,null,null,null,null,null,"{\"id\": \"\"","","","","","","","","","","","","","","","","","","","}","{\"id\": \"\"}"," "]
[null,null,null,null,null,null,null,null,null,null,null,null,null,null,null,null,null,null,null,null,null,null,null,null,null,null,null,null,null,"{\"id\": \"\"","","","","","","","","","","","","","","","","","","","}","{\"id\": \"\"}"," "]
[null,null,null,null,null,null,null,null,null,null,null,null,null,null,null,null,null,null,null,null,null,null,null,null,null,null,null,null,null,"{\"id\": \"\"","","","","","","","","","","","","","","","","","","","}","{\"id\": \"\"}"," "]
[null,null,null,null,null,null,null,null,null,null,null,null,null,null,null,null,null,null,null,null,null,null,null,null,null,null,null,null,null,"{\"id\": \"\"","","","","","","","","","","","","","","","","","","","}","{\"id\": \"\"}"," "]
[null,null,null,null,null,null,null,null,null,null,null,null,null,null,null,null,null,null,null,null,null,null,null,null,null,null,null,null,null,"{\"id\": \"\"","","","","","","","","","","","","","","","","","","","}","{\"id\": \"\"}"," "]
[null,null,null,null,null,null,null,null,null,null,null,null,null,null,null,null,null,null,null,null,null,null,null,null,null,null,null,null,null,"{\"id\": \"\"","","","","","","","","","","","","","","","","","","","}","{\"id\": \"\"}"," "]
[null,null,null,null,null,null,null,null,null,null,null,null,null,null,null,null,null,null,null,null,null,null,null,null,null,null,null,null,null,"{\"id\": \"\"","","","","","","","","","","","","","","","","","","","}","{\"id\": \"\"}"," "]
[null,null,null,null,null,null,null,null,null,null,null,null,null,null,null,null,null,null,null,null,null,null,null,null,null,null,null,null,null,{"$f":"CONCATENATE(\"{\"\"\",A$2,\"\"\": \"\"\",A138,\"\"\"\")","v":"{\"id\": \"\""},{"$f":"IF(C138<>\"\",CONCATENATE(\",\"\"\",C$2,\"\"\":\"\"\",C138,\"\"\"\"),\"\")","v":""},{"$f":"IF(D138<>\"\",CONCATENATE(\",\"\"\",D$2,\"\"\":\"\"\",D138,\"\"\"\"),\"\")","v":""},{"$f":"IF(E138<>\"\",CONCATENATE(\",\"\"\",E$2,\"\"\":\"\"\",E138,\"\"\"\"),\"\")","v":""},{"$f":"IF(F138<>\"\",CONCATENATE(\",\"\"representations\"\":[{\"\"file\"\":\"\"\",F138,\"\"\",\"\"unit\"\":\",G138,\"}]\"),\"\")","v":""},{"$f":"IF(H138<>\"\",CONCATENATE(\",\"\"\",H$2,\"\"\":[\",H138,\",\",I138,\",\",J138,\"]\"),\"\")","v":""},{"$f":"IF(K138<>\"\",CONCATENATE(\",\"\"\",K$2,\"\"\":[\",K138,\",\",L138,\",\",M138,\"]\"),\"\")","v":""},{"$f":"IF(N138<>\"\",CONCATENATE(\",\"\"\",N$2,\"\"\":\"\"\",N138,\"\"\"\"),\"\")","v":""},{"$f":"IF(O138<>\"\",CONCATENATE(\",\"\"\",O$2,\"\"\":\"\"\",O138,\"\"\"\"),\"\")","v":""},{"$f":"IF(P138<>\"\",CONCATENATE(\",\"\"\",P$2,\"\"\":[\"\"\",P138,\"\"\"]\"),\"\")","v":""},{"$f":"IF(Q138<>\"\",CONCATENATE(\",\"\"\",Q$2,\"\"\":[\"\"\",Q138,\"\"\"]\"),\"\")","v":""},{"$f":"IF(R138<>\"\",CONCATENATE(\",\"\"\",R$2,\"\"\":[\"\"\",R138,\"\"\"]\"),\"\")","v":""},{"$f":"IF(S138<>\"\",CONCATENATE(\",\"\"\",S$2,\"\"\":\",S138),\"\")","v":""},{"$f":"IF(T138<>\"\",CONCATENATE(\",\"\"\",T$2,\"\"\":{\",T138,\"}\"),\"\")","v":""},{"$f":"IF(U138<>\"\",CONCATENATE(\",\"\"failureModes\"\":[{\"\"TTF\"\":\"\"\",U138,\"\"\",\"\"TTR\"\":\"\"\",V138,\"\"\"}\",IF(W138<>\"\",CONCATENATE(\",{\"\"TTF\"\":\"\"\",W138,\"\"\",\"\"TTR\"\":\"\"\",X138,\"\"\"}\",),\"\"),\"]\"),\"\")","v":""},{"$f":"IF(Y138<>\"\",CONCATENATE(\",\"\"\",Y$2,\"\"\":\",SUBSTITUTE(SUBSTITUTE(Y138, CHAR(10),\" \"), CHAR(9),\" \")),\"\")","v":""},{"$f":"IF(Z138<>\"\",CONCATENATE(\",\"\"\",Z$2,\"\"\":[\",Z138,\"]\"),\"\")","v":""},{"$f":"IF(AA138<>\"\",CONCATENATE(\",\"\"\",AA$2,\"\"\":\",AA138),\"\")","v":""},{"$f":"IF(AB138<>\"\",CONCATENATE(\",\"\"\",AB$2,\"\"\":[\",AB138,\"]\"),\"\")","v":""},"}",{"$f":"CONCATENATE(AD138,AE138,AF138,AG138,AH138,AI138,AJ138,AK138,AL138,AM138,AN138,AO138,AP138,AQ138,AR138,AS138,AT138,AU138,AV138,AW138)","v":"{\"id\": \"\"}"}," "]
[null,null,null,null,null,null,null,null,null,null,null,null,null,null,null,null,null,null,null,null,null,null,null,null,null,null,null,null,null,"{\"id\": \"\"","","","","","","","","","","","","","","","","","","","}","{\"id\": \"\"}"," "]
[null,null,null,null,null,null,null,null,null,null,null,null,null,null,null,null,null,null,null,null,null,null,null,null,null,null,null,null,null,"{\"id\": \"\"","","","","","","","","","","","","","","","","","","","}","{\"id\": \"\"}"," "]
[null,null,null,null,null,null,null,null,null,null,null,null,null,null,null,null,null,null,null,null,null,null,null,null,null,null,null,null,null,"{\"id\": \"\"","","","","","","","","","","","","","","","","","","","}","{\"id\": \"\"}"," "]
[null,null,null,null,null,null,null,null,null,null,null,null,null,null,null,null,null,null,null,null,null,null,null,null,null,null,null,null,null,"{\"id\": \"\"","","","","","","","","","","","","","","","","","","","}","{\"id\": \"\"}"," "]
[null,null,null,null,null,null,null,null,null,null,null,null,null,null,null,null,null,null,null,null,null,null,null,null,null,null,null,null,null,"{\"id\": \"\"","","","","","","","","","","","","","","","","","","","}","{\"id\": \"\"}"," "]
[null,null,null,null,null,null,null,null,null,null,null,null,null,null,null,null,null,null,null,null,null,null,null,null,null,null,null,null,null,"{\"id\": \"\"","","","","","","","","","","","","","","","","","","","}","{\"id\": \"\"}"," "]
[null,null,null,null,null,null,null,null,null,null,null,null,null,null,null,null,null,null,null,null,null,null,null,null,null,null,null,null,null,"{\"id\": \"\"","","","","","","","","","","","","","","","","","","","}","{\"id\": \"\"}"," "]
[null,null,null,null,null,null,null,null,null,null,null,null,null,null,null,null,null,null,null,null,null,null,null,null,null,null,null,null,null,"{\"id\": \"\"","","","","","","","","","","","","","","","","","","","}","{\"id\": \"\"}"," "]
[null,null,null,null,null,null,null,null,null,null,null,null,null,null,null,null,null,null,null,null,null,null,null,null,null,null,null,null,null,"{\"id\": \"\"","","","","","","","","","","","","","","","","","","","}","{\"id\": \"\"}"," "]
[null,null,null,null,null,null,null,null,null,null,null,null,null,null,null,null,null,null,null,null,null,null,null,null,null,null,null,null,null,"{\"id\": \"\"","","","","","","","","","","","","","","","","","","","}","{\"id\": \"\"}"," "]
[null,null,null,null,null,null,null,null,null,null,null,null,null,null,null,null,null,null,null,null,null,null,null,null,null,null,null,null,null,"{\"id\": \"\"","","","","","","","","","","","","","","","","","","","}","{\"id\": \"\"}"," "]
[null,null,null,null,null,null,null,null,null,null,null,null,null,null,null,null,null,null,null,null,null,null,null,null,null,null,null,null,null,"{\"id\": \"\"","","","","","","","","","","","","","","","","","","","}","{\"id\": \"\"}"," "]
[null,null,null,null,null,null,null,null,null,null,null,null,null,null,null,null,null,null,null,null,null,null,null,null,null,null,null,null,null,"{\"id\": \"\"","","","","","","","","","","","","","","","","","","","}","{\"id\": \"\"}"," "]
[null,null,null,null,null,null,null,null,null,null,null,null,null,null,null,null,null,null,null,null,null,null,null,null,null,null,null,null,null,"{\"id\": \"\"","","","","","","","","","","","","","","","","","","","}","{\"id\": \"\"}"," "]
[null,null,null,null,null,null,null,null,null,null,null,null,null,null,null,null,null,null,null,null,null,null,null,null,null,null,null,null,null,"{\"id\": \"\"","","","","","","","","","","","","","","","","","","","}","{\"id\": \"\"}"," "]
[null,null,null,null,null,null,null,null,null,null,null,null,null,null,null,null,null,null,null,null,null,null,null,null,null,null,null,null,null,"{\"id\": \"\"","","","","","","","","","","","","","","","","","","","}","{\"id\": \"\"}"," "]
[null,null,null,null,null,null,null,null,null,null,null,null,null,null,null,null,null,null,null,null,null,null,null,null,null,null,null,null,null,"{\"id\": \"\"","","","","","","","","","","","","","","","","","","","}","{\"id\": \"\"}"," "]
[null,null,null,null,null,null,null,null,null,null,null,null,null,null,null,null,null,null,null,null,null,null,null,null,null,null,null,null,null,"{\"id\": \"\"","","","","","","","","","","","","","","","","","","","}","{\"id\": \"\"}"," "]
[null,null,null,null,null,null,null,null,null,null,null,null,null,null,null,null,null,null,null,null,null,null,null,null,null,null,null,null,null,"{\"id\": \"\"","","","","","","","","","","","","","","","","","","","}","{\"id\": \"\"}"," "]
[null,null,null,null,null,null,null,null,null,null,null,null,null,null,null,null,null,null,null,null,null,null,null,null,null,null,null,null,null,"{\"id\": \"\"","","","","","","","","","","","","","","","","","","","}","{\"id\": \"\"}"," "]
[null,null,null,null,null,null,null,null,null,null,null,null,null,null,null,null,null,null,null,null,null,null,null,null,null,null,null,null,null,"{\"id\": \"\"","","","","","","","","","","","","","","","","","","","}","{\"id\": \"\"}"," "]
[null,null,null,null,null,null,null,null,null,null,null,null,null,null,null,null,null,null,null,null,null,null,null,null,null,null,null,null,null,"{\"id\": \"\"","","","","","","","","","","","","","","","","","","","}","{\"id\": \"\"}"," "]
[null,null,null,null,null,null,null,null,null,null,null,null,null,null,null,null,null,null,null,null,null,null,null,null,null,null,null,null,null,"{\"id\": \"\"","","","","","","","","","","","","","","","","","","","}","{\"id\": \"\"}"," "]
[null,null,null,null,null,null,null,null,null,null,null,null,null,null,null,null,null,null,null,null,null,null,null,null,null,null,null,null,null,"{\"id\": \"\"","","","","","","","","","","","","","","","","","","","}","{\"id\": \"\"}"," "]
[null,null,null,null,null,null,null,null,null,null,null,null,null,null,null,null,null,null,null,null,null,null,null,null,null,null,null,null,null,"{\"id\": \"\"","","","","","","","","","","","","","","","","","","","}","{\"id\": \"\"}"," "]
[null,null,null,null,null,null,null,null,null,null,null,null,null,null,null,null,null,null,null,null,null,null,null,null,null,null,null,null,null,{"$f":"CONCATENATE(\"{\"\"\",A$2,\"\"\": \"\"\",A164,\"\"\"\")","v":"{\"id\": \"\""},{"$f":"IF(C164<>\"\",CONCATENATE(\",\"\"\",C$2,\"\"\":\"\"\",C164,\"\"\"\"),\"\")","v":""},{"$f":"IF(D164<>\"\",CONCATENATE(\",\"\"\",D$2,\"\"\":\"\"\",D164,\"\"\"\"),\"\")","v":""},{"$f":"IF(E164<>\"\",CONCATENATE(\",\"\"\",E$2,\"\"\":\"\"\",E164,\"\"\"\"),\"\")","v":""},{"$f":"IF(F164<>\"\",CONCATENATE(\",\"\"representations\"\":[{\"\"file\"\":\"\"\",F164,\"\"\",\"\"unit\"\":\",G164,\"}]\"),\"\")","v":""},{"$f":"IF(H164<>\"\",CONCATENATE(\",\"\"\",H$2,\"\"\":[\",H164,\",\",I164,\",\",J164,\"]\"),\"\")","v":""},{"$f":"IF(K164<>\"\",CONCATENATE(\",\"\"\",K$2,\"\"\":[\",K164,\",\",L164,\",\",M164,\"]\"),\"\")","v":""},{"$f":"IF(N164<>\"\",CONCATENATE(\",\"\"\",N$2,\"\"\":\"\"\",N164,\"\"\"\"),\"\")","v":""},{"$f":"IF(O164<>\"\",CONCATENATE(\",\"\"\",O$2,\"\"\":\"\"\",O164,\"\"\"\"),\"\")","v":""},{"$f":"IF(P164<>\"\",CONCATENATE(\",\"\"\",P$2,\"\"\":[\"\"\",P164,\"\"\"]\"),\"\")","v":""},{"$f":"IF(Q164<>\"\",CONCATENATE(\",\"\"\",Q$2,\"\"\":[\"\"\",Q164,\"\"\"]\"),\"\")","v":""},{"$f":"IF(R164<>\"\",CONCATENATE(\",\"\"\",R$2,\"\"\":[\"\"\",R164,\"\"\"]\"),\"\")","v":""},{"$f":"IF(S164<>\"\",CONCATENATE(\",\"\"\",S$2,\"\"\":\",S164),\"\")","v":""},{"$f":"IF(T164<>\"\",CONCATENATE(\",\"\"\",T$2,\"\"\":{\",T164,\"}\"),\"\")","v":""},{"$f":"IF(U164<>\"\",CONCATENATE(\",\"\"failureModes\"\":[{\"\"TTF\"\":\"\"\",U164,\"\"\",\"\"TTR\"\":\"\"\",V164,\"\"\"}\",IF(W164<>\"\",CONCATENATE(\",{\"\"TTF\"\":\"\"\",W164,\"\"\",\"\"TTR\"\":\"\"\",X164,\"\"\"}\",),\"\"),\"]\"),\"\")","v":""},{"$f":"IF(Y164<>\"\",CONCATENATE(\",\"\"\",Y$2,\"\"\":\",SUBSTITUTE(SUBSTITUTE(Y164, CHAR(10),\" \"), CHAR(9),\" \")),\"\")","v":""},{"$f":"IF(Z164<>\"\",CONCATENATE(\",\"\"\",Z$2,\"\"\":[\",Z164,\"]\"),\"\")","v":""},{"$f":"IF(AA164<>\"\",CONCATENATE(\",\"\"\",AA$2,\"\"\":\",AA164),\"\")","v":""},{"$f":"IF(AB164<>\"\",CONCATENATE(\",\"\"\",AB$2,\"\"\":[\",AB164,\"]\"),\"\")","v":""},"}",{"$f":"CONCATENATE(AD164,AE164,AF164,AG164,AH164,AI164,AJ164,AK164,AL164,AM164,AN164,AO164,AP164,AQ164,AR164,AS164,AT164,AU164,AV164,AW164)","v":"{\"id\": \"\"}"}," "]
[null,null,null,null,null,null,null,null,null,null,null,null,null,null,null,null,null,null,null,null,null,null,null,null,null,null,null,null,null,"{\"id\": \"\"","","","","","","","","","","","","","","","","","","","}","{\"id\": \"\"}"," "]
[null,null,null,null,null,null,null,null,null,null,null,null,null,null,null,null,null,null,null,null,null,null,null,null,null,null,null,null,null,"{\"id\": \"\"","","","","","","","","","","","","","","","","","","","}","{\"id\": \"\"}"," "]
[null,null,null,null,null,null,null,null,null,null,null,null,null,null,null,null,null,null,null,null,null,null,null,null,null,null,null,null,null,"{\"id\": \"\"","","","","","","","","","","","","","","","","","","","}","{\"id\": \"\"}"," "]
[null,null,null,null,null,null,null,null,null,null,null,null,null,null,null,null,null,null,null,null,null,null,null,null,null,null,null,null,null,"{\"id\": \"\"","","","","","","","","","","","","","","","","","","","}","{\"id\": \"\"}"," "]
[null,null,null,null,null,null,null,null,null,null,null,null,null,null,null,null,null,null,null,null,null,null,null,null,null,null,null,null,null,"{\"id\": \"\"","","","","","","","","","","","","","","","","","","","}","{\"id\": \"\"}"," "]
[null,null,null,null,null,null,null,null,null,null,null,null,null,null,null,null,null,null,null,null,null,null,null,null,null,null,null,null,null,"{\"id\": \"\"","","","","","","","","","","","","","","","","","","","}","{\"id\": \"\"}"," "]
[null,null,null,null,null,null,null,null,null,null,null,null,null,null,null,null,null,null,null,null,null,null,null,null,null,null,null,null,null,"{\"id\": \"\"","","","","","","","","","","","","","","","","","","","}","{\"id\": \"\"}"," "]
[null,null,null,null,null,null,null,null,null,null,null,null,null,null,null,null,null,null,null,null,null,null,null,null,null,null,null,null,null,"{\"id\": \"\"","","","","","","","","","","","","","","","","","","","}","{\"id\": \"\"}"," "]
[null,null,null,null,null,null,null,null,null,null,null,null,null,null,null,null,null,null,null,null,null,null,null,null,null,null,null,null,null,"{\"id\": \"\"","","","","","","","","","","","","","","","","","","","}","{\"id\": \"\"}"," "]
[null,null,null,null,null,null,null,null,null,null,null,null,null,null,null,null,null,null,null,null,null,null,null,null,null,null,null,null,null,"{\"id\": \"\"","","","","","","","","","","","","","","","","","","","}","{\"id\": \"\"}"," "]
[null,null,null,null,null,null,null,null,null,null,null,null,null,null,null,null,null,null,null,null,null,null,null,null,null,null,null,null,null,"{\"id\": \"\"","","","","","","","","","","","","","","","","","","","}","{\"id\": \"\"}"," "]
[null,null,null,null,null,null,null,null,null,null,null,null,null,null,null,null,null,null,null,null,null,null,null,null,null,null,null,null,null,"{\"id\": \"\"","","","","","","","","","","","","","","","","","","","}","{\"id\": \"\"}"," "]
[null,null,null,null,null,null,null,null,null,null,null,null,null,null,null,null,null,null,null,null,null,null,null,null,null,null,null,null,null,"{\"id\": \"\"","","","","","","","","","","","","","","","","","","","}","{\"id\": \"\"}"," "]
[null,null,null,null,null,null,null,null,null,null,null,null,null,null,null,null,null,null,null,null,null,null,null,null,null,null,null,null,null,"{\"id\": \"\"","","","","","","","","","","","","","","","","","","","}","{\"id\": \"\"}"," "]
[null,null,null,null,null,null,null,null,null,null,null,null,null,null,null,null,null,null,null,null,null,null,null,null,null,null,null,null,null,"{\"id\": \"\"","","","","","","","","","","","","","","","","","","","}","{\"id\": \"\"}"," "]
[null,null,null,null,null,null,null,null,null,null,null,null,null,null,null,null,null,null,null,null,null,null,null,null,null,null,null,null,null,"{\"id\": \"\"","","","","","","","","","","","","","","","","","","","}","{\"id\": \"\"}"," "]
[null,null,null,null,null,null,null,null,null,null,null,null,null,null,null,null,null,null,null,null,null,null,null,null,null,null,null,null,null,"{\"id\": \"\"","","","","","","","","","","","","","","","","","","","}","{\"id\": \"\"}"," "]
[null,null,null,null,null,null,null,null,null,null,null,null,null,null,null,null,null,null,null,null,null,null,null,null,null,null,null,null,null,"{\"id\": \"\"","","","","","","","","","","","","","","","","","","","}","{\"id\": \"\"}"," "]
[null,null,null,null,null,null,null,null,null,null,null,null,null,null,null,null,null,null,null,null,null,null,null,null,null,null,null,null,null,"{\"id\": \"\"","","","","","","","","","","","","","","","","","","","}","{\"id\": \"\"}"," "]
[null,null,null,null,null,null,null,null,null,null,null,null,null,null,null,null,null,null,null,null,null,null,null,null,null,null,null,null,null,"{\"id\": \"\"","","","","","","","","","","","","","","","","","","","}","{\"id\": \"\"}"," "]
[null,null,null,null,null,null,null,null,null,null,null,null,null,null,null,null,null,null,null,null,null,null,null,null,null,null,null,null,null,"{\"id\": \"\"","","","","","","","","","","","","","","","","","","","}","{\"id\": \"\"}"," "]
[null,null,null,null,null,null,null,null,null,null,null,null,null,null,null,null,null,null,null,null,null,null,null,null,null,null,null,null,null,"{\"id\": \"\"","","","","","","","","","","","","","","","","","","","}","{\"id\": \"\"}"," "]
[null,null,null,null,null,null,null,null,null,null,null,null,null,null,null,null,null,null,null,null,null,null,null,null,null,null,null,null,null,"{\"id\": \"\"","","","","","","","","","","","","","","","","","","","}","{\"id\": \"\"}"," "]
[null,null,null,null,null,null,null,null,null,null,null,null,null,null,null,null,null,null,null,null,null,null,null,null,null,null,null,null,null,"{\"id\": \"\"","","","","","","","","","","","","","","","","","","","}","{\"id\": \"\"}"," "]
[null,null,null,null,null,null,null,null,null,null,null,null,null,null,null,null,null,null,null,null,null,null,null,null,null,null,null,null,null,"{\"id\": \"\"","","","","","","","","","","","","","","","","","","","}","{\"id\": \"\"}"," "]
[null,null,null,null,null,null,null,null,null,null,null,null,null,null,null,null,null,null,null,null,null,null,null,null,null,null,null,null,null,"{\"id\": \"\"","","","","","","","","","","","","","","","","","","","}","{\"id\": \"\"}"," "]
[null,null,null,null,null,null,null,null,null,null,null,null,null,null,null,null,null,null,null,null,null,null,null,null,null,null,null,null,null,"{\"id\": \"\"","","","","","","","","","","","","","","","","","","","}","{\"id\": \"\"}"," "]
[null,null,null,null,null,null,null,null,null,null,null,null,null,null,null,null,null,null,null,null,null,null,null,null,null,null,null,null,null,"{\"id\": \"\"","","","","","","","","","","","","","","","","","","","}","{\"id\": \"\"}"," "]
[null,null,null,null,null,null,null,null,null,null,null,null,null,null,null,null,null,null,null,null,null,null,null,null,null,null,null,null,null,"{\"id\": \"\"","","","","","","","","","","","","","","","","","","","}","{\"id\": \"\"}"," "]
[null,null,null,null,null,null,null,null,null,null,null,null,null,null,null,null,null,null,null,null,null,null,null,null,null,null,null,null,null,"{\"id\": \"\"","","","","","","","","","","","","","","","","","","","}","{\"id\": \"\"}"," "]
[null,null,null,null,null,null,null,null,null,null,null,null,null,null,null,null,null,null,null,null,null,null,null,null,null,null,null,null,null,"{\"id\": \"\"","","","","","","","","","","","","","","","","","","","}","{\"id\": \"\"}"," "]
[null,null,null,null,null,null,null,null,null,null,null,null,null,null,null,null,null,null,null,null,null,null,null,null,null,null,null,null,null,"{\"id\": \"\"","","","","","","","","","","","","","","","","","","","}","{\"id\": \"\"}"," "]
[null,null,null,null,null,null,null,null,null,null,null,null,null,null,null,null,null,null,null,null,null,null,null,null,null,null,null,null,null,"{\"id\": \"\"","","","","","","","","","","","","","","","","","","","}","{\"id\": \"\"}"," "]
[null,null,null,null,null,null,null,null,null,null,null,null,null,null,null,null,null,null,null,null,null,null,null,null,null,null,null,null,null,"{\"id\": \"\"","","","","","","","","","","","","","","","","","","","}","{\"id\": \"\"}"," "]
[null,null,null,null,null,null,null,null,null,null,null,null,null,null,null,null,null,null,null,null,null,null,null,null,null,null,null,null,null,"{\"id\": \"\"","","","","","","","","","","","","","","","","","","","}","{\"id\": \"\"}"," "]
[null,null,null,null,null,null,null,null,null,null,null,null,null,null,null,null,null,null,null,null,null,null,null,null,null,null,null,null,null,"{\"id\": \"\"","","","","","","","","","","","","","","","","","","","}","{\"id\": \"\"}"," "]
[null,null,null,null,null,null,null,null,null,null,null,null,null,null,null,null,null,null,null,null,null,null,null,null,null,null,null,null,null,"{\"id\": \"\"","","","","","","","","","","","","","","","","","","","}","{\"id\": \"\"}"," "]
[null,null,null,null,null,null,null,null,null,null,null,null,null,null,null,null,null,null,null,null,null,null,null,null,null,null,null,null,null,"{\"id\": \"\"","","","","","","","","","","","","","","","","","","","}","{\"id\": \"\"}"," "]
[null,null,null,null,null,null,null,null,null,null,null,null,null,null,null,null,null,null,null,null,null,null,null,null,null,null,null,null,null,"{\"id\": \"\"","","","","","","","","","","","","","","","","","","","}","{\"id\": \"\"}"," "]
[null,null,null,null,null,null,null,null,null,null,null,null,null,null,null,null,null,null,null,null,null,null,null,null,null,null,null,null,null,"{\"id\": \"\"","","","","","","","","","","","","","","","","","","","}","{\"id\": \"\"}"," "]
[null,null,null,null,null,null,null,null,null,null,null,null,null,null,null,null,null,null,null,null,null,null,null,null,null,null,null,null,null,"{\"id\": \"\"","","","","","","","","","","","","","","","","","","","}","{\"id\": \"\"}"," "]
[null,null,null,null,null,null,null,null,null,null,null,null,null,null,null,null,null,null,null,null,null,null,null,null,null,null,null,null,null,"{\"id\": \"\"","","","","","","","","","","","","","","","","","","","}","{\"id\": \"\"}"," "]
[null,null,null,null,null,null,null,null,null,null,null,null,null,null,null,null,null,null,null,null,null,null,null,null,null,null,null,null,null,"{\"id\": \"\"","","","","","","","","","","","","","","","","","","","}","{\"id\": \"\"}"," "]
[null,null,null,null,null,null,null,null,null,null,null,null,null,null,null,null,null,null,null,null,null,null,null,null,null,null,null,null,null,"{\"id\": \"\"","","","","","","","","","","","","","","","","","","","}","{\"id\": \"\"}"," "]
[null,null,null,null,null,null,null,null,null,null,null,null,null,null,null,null,null,null,null,null,null,null,null,null,null,null,null,null,null,"{\"id\": \"\"","","","","","","","","","","","","","","","","","","","}","{\"id\": \"\"}"," "]
[null,null,null,null,null,null,null,null,null,null,null,null,null,null,null,null,null,null,null,null,null,null,null,null,null,null,null,null,null,"{\"id\": \"\"","","","","","","","","","","","","","","","","","","","}","{\"id\": \"\"}"," "]
[null,null,null,null,null,null,null,null,null,null,null,null,null,null,null,null,null,null,null,null,null,null,null,null,null,null,null,null,null,"{\"id\": \"\"","","","","","","","","","","","","","","","","","","","}","{\"id\": \"\"}"," "]
[null,null,null,null,null,null,null,null,null,null,null,null,null,null,null,null,null,null,null,null,null,null,null,null,null,null,null,null,null,"{\"id\": \"\"","","","","","","","","","","","","","","","","","","","}","{\"id\": \"\"}"," "]
[null,null,null,null,null,null,null,null,null,null,null,null,null,null,null,null,null,null,null,null,null,null,null,null,null,null,null,null,null,"{\"id\": \"\"","","","","","","","","","","","","","","","","","","","}","{\"id\": \"\"}"," "]
[null,null,null,null,null,null,null,null,null,null,null,null,null,null,null,null,null,null,null,null,null,null,null,null,null,null,null,null,null,"{\"id\": \"\"","","","","","","","","","","","","","","","","","","","}","{\"id\": \"\"}"," "]
[null,null,null,null,null,null,null,null,null,null,null,null,null,null,null,null,null,null,null,null,null,null,null,null,null,null,null,null,null,"{\"id\": \"\"","","","","","","","","","","","","","","","","","","","}","{\"id\": \"\"}"," "]
[null,null,null,null,null,null,null,null,null,null,null,null,null,null,null,null,null,null,null,null,null,null,null,null,null,null,null,null,null,"{\"id\": \"\"","","","","","","","","","","","","","","","","","","","}","{\"id\": \"\"}"," "]
[null,null,null,null,null,null,null,null,null,null,null,null,null,null,null,null,null,null,null,null,null,null,null,null,null,null,null,null,null,"{\"id\": \"\"","","","","","","","","","","","","","","","","","","","}","{\"id\": \"\"}"," "]
[null,null,null,null,null,null,null,null,null,null,null,null,null,null,null,null,null,null,null,null,null,null,null,null,null,null,null,null,null,"{\"id\": \"\"","","","","","","","","","","","","","","","","","","","}","{\"id\": \"\"}"," "]
[null,null,null,null,null,null,null,null,null,null,null,null,null,null,null,null,null,null,null,null,null,null,null,null,null,null,null,null,null,"{\"id\": \"\"","","","","","","","","","","","","","","","","","","","}","{\"id\": \"\"}"," "]
[null,null,null,null,null,null,null,null,null,null,null,null,null,null,null,null,null,null,null,null,null,null,null,null,null,null,null,null,null,"{\"id\": \"\"","","","","","","","","","","","","","","","","","","","}","{\"id\": \"\"}"," "]
[null,null,null,null,null,null,null,null,null,null,null,null,null,null,null,null,null,null,null,null,null,null,null,null,null,null,null,null,null,"{\"id\": \"\"","","","","","","","","","","","","","","","","","","","}","{\"id\": \"\"}"," "]
[null,null,null,null,null,null,null,null,null,null,null,null,null,null,null,null,null,null,null,null,null,null,null,null,null,null,null,null,null,"{\"id\": \"\"","","","","","","","","","","","","","","","","","","","}","{\"id\": \"\"}"," "]
[null,null,null,null,null,null,null,null,null,null,null,null,null,null,null,null,null,null,null,null,null,null,null,null,null,null,null,null,null,"{\"id\": \"\"","","","","","","","","","","","","","","","","","","","}","{\"id\": \"\"}"," "]
[null,null,null,null,null,null,null,null,null,null,null,null,null,null,null,null,null,null,null,null,null,null,null,null,null,null,null,null,null,"{\"id\": \"\"","","","","","","","","","","","","","","","","","","","}","{\"id\": \"\"}"," "]
[null,null,null,null,null,null,null,null,null,null,null,null,null,null,null,null,null,null,null,null,null,null,null,null,null,null,null,null,null,"{\"id\": \"\"","","","","","","","","","","","","","","","","","","","}","{\"id\": \"\"}"," "]
[null,null,null,null,null,null,null,null,null,null,null,null,null,null,null,null,null,null,null,null,null,null,null,null,null,null,null,null,null,"{\"id\": \"\"","","","","","","","","","","","","","","","","","","","}","{\"id\": \"\"}"," "]
[null,null,null,null,null,null,null,null,null,null,null,null,null,null,null,null,null,null,null,null,null,null,null,null,null,null,null,null,null,"{\"id\": \"\"","","","","","","","","","","","","","","","","","","","}","{\"id\": \"\"}"," "]
[null,null,null,null,null,null,null,null,null,null,null,null,null,null,null,null,null,null,null,null,null,null,null,null,null,null,null,null,null,{"$f":"CONCATENATE(\"{\"\"\",A$2,\"\"\": \"\"\",A228,\"\"\"\")","v":"{\"id\": \"\""},{"$f":"IF(C228<>\"\",CONCATENATE(\",\"\"\",C$2,\"\"\":\"\"\",C228,\"\"\"\"),\"\")","v":""},{"$f":"IF(D228<>\"\",CONCATENATE(\",\"\"\",D$2,\"\"\":\"\"\",D228,\"\"\"\"),\"\")","v":""},{"$f":"IF(E228<>\"\",CONCATENATE(\",\"\"\",E$2,\"\"\":\"\"\",E228,\"\"\"\"),\"\")","v":""},{"$f":"IF(F228<>\"\",CONCATENATE(\",\"\"representations\"\":[{\"\"file\"\":\"\"\",F228,\"\"\",\"\"unit\"\":\",G228,\"}]\"),\"\")","v":""},{"$f":"IF(H228<>\"\",CONCATENATE(\",\"\"\",H$2,\"\"\":[\",H228,\",\",I228,\",\",J228,\"]\"),\"\")","v":""},{"$f":"IF(K228<>\"\",CONCATENATE(\",\"\"\",K$2,\"\"\":[\",K228,\",\",L228,\",\",M228,\"]\"),\"\")","v":""},{"$f":"IF(N228<>\"\",CONCATENATE(\",\"\"\",N$2,\"\"\":\"\"\",N228,\"\"\"\"),\"\")","v":""},{"$f":"IF(O228<>\"\",CONCATENATE(\",\"\"\",O$2,\"\"\":\"\"\",O228,\"\"\"\"),\"\")","v":""},{"$f":"IF(P228<>\"\",CONCATENATE(\",\"\"\",P$2,\"\"\":[\"\"\",P228,\"\"\"]\"),\"\")","v":""},{"$f":"IF(Q228<>\"\",CONCATENATE(\",\"\"\",Q$2,\"\"\":[\"\"\",Q228,\"\"\"]\"),\"\")","v":""},{"$f":"IF(R228<>\"\",CONCATENATE(\",\"\"\",R$2,\"\"\":[\"\"\",R228,\"\"\"]\"),\"\")","v":""},{"$f":"IF(S228<>\"\",CONCATENATE(\",\"\"\",S$2,\"\"\":\",S228),\"\")","v":""},{"$f":"IF(T228<>\"\",CONCATENATE(\",\"\"\",T$2,\"\"\":{\",T228,\"}\"),\"\")","v":""},{"$f":"IF(U228<>\"\",CONCATENATE(\",\"\"failureModes\"\":[{\"\"TTF\"\":\"\"\",U228,\"\"\",\"\"TTR\"\":\"\"\",V228,\"\"\"}\",IF(W228<>\"\",CONCATENATE(\",{\"\"TTF\"\":\"\"\",W228,\"\"\",\"\"TTR\"\":\"\"\",X228,\"\"\"}\",),\"\"),\"]\"),\"\")","v":""},{"$f":"IF(Y228<>\"\",CONCATENATE(\",\"\"\",Y$2,\"\"\":\",SUBSTITUTE(SUBSTITUTE(Y228, CHAR(10),\" \"), CHAR(9),\" \")),\"\")","v":""},{"$f":"IF(Z228<>\"\",CONCATENATE(\",\"\"\",Z$2,\"\"\":[\",Z228,\"]\"),\"\")","v":""},{"$f":"IF(AA228<>\"\",CONCATENATE(\",\"\"\",AA$2,\"\"\":\",AA228),\"\")","v":""},{"$f":"IF(AB228<>\"\",CONCATENATE(\",\"\"\",AB$2,\"\"\":[\",AB228,\"]\"),\"\")","v":""},"}",{"$f":"CONCATENATE(AD228,AE228,AF228,AG228,AH228,AI228,AJ228,AK228,AL228,AM228,AN228,AO228,AP228,AQ228,AR228,AS228,AT228,AU228,AV228,AW228)","v":"{\"id\": \"\"}"}," "]
[null,null,null,null,null,null,null,null,null,null,null,null,null,null,null,null,null,null,null,null,null,null,null,null,null,null,null,null,null,"{\"id\": \"\"","","","","","","","","","","","","","","","","","","","}","{\"id\": \"\"}"," "]
[null,null,null,null,null,null,null,null,null,null,null,null,null,null,null,null,null,null,null,null,null,null,null,null,null,null,null,null,null,"{\"id\": \"\"","","","","","","","","","","","","","","","","","","","}","{\"id\": \"\"}"," "]
[null,null,null,null,null,null,null,null,null,null,null,null,null,null,null,null,null,null,null,null,null,null,null,null,null,null,null,null,null,"{\"id\": \"\"","","","","","","","","","","","","","","","","","","","}","{\"id\": \"\"}"," "]
[null,null,null,null,null,null,null,null,null,null,null,null,null,null,null,null,null,null,null,null,null,null,null,null,null,null,null,null,null,"{\"id\": \"\"","","","","","","","","","","","","","","","","","","","}","{\"id\": \"\"}"," "]
[null,null,null,null,null,null,null,null,null,null,null,null,null,null,null,null,null,null,null,null,null,null,null,null,null,null,null,null,null,"{\"id\": \"\"","","","","","","","","","","","","","","","","","","","}","{\"id\": \"\"}"," "]
[null,null,null,null,null,null,null,null,null,null,null,null,null,null,null,null,null,null,null,null,null,null,null,null,null,null,null,null,null,"{\"id\": \"\"","","","","","","","","","","","","","","","","","","","}","{\"id\": \"\"}"," "]
[null,null,null,null,null,null,null,null,null,null,null,null,null,null,null,null,null,null,null,null,null,null,null,null,null,null,null,null,null,"{\"id\": \"\"","","","","","","","","","","","","","","","","","","","}","{\"id\": \"\"}"," "]
[null,null,null,null,null,null,null,null,null,null,null,null,null,null,null,null,null,null,null,null,null,null,null,null,null,null,null,null,null,"{\"id\": \"\"","","","","","","","","","","","","","","","","","","","}","{\"id\": \"\"}"," "]
[null,null,null,null,null,null,null,null,null,null,null,null,null,null,null,null,null,null,null,null,null,null,null,null,null,null,null,null,null,"{\"id\": \"\"","","","","","","","","","","","","","","","","","","","}","{\"id\": \"\"}"," "]
[null,null,null,null,null,null,null,null,null,null,null,null,null,null,null,null,null,null,null,null,null,null,null,null,null,null,null,null,null,"{\"id\": \"\"","","","","","","","","","","","","","","","","","","","}","{\"id\": \"\"}"," "]
[null,null,null,null,null,null,null,null,null,null,null,null,null,null,null,null,null,null,null,null,null,null,null,null,null,null,null,null,null,"{\"id\": \"\"","","","","","","","","","","","","","","","","","","","}","{\"id\": \"\"}"," "]
[null,null,null,null,null,null,null,null,null,null,null,null,null,null,null,null,null,null,null,null,null,null,null,null,null,null,null,null,null,"{\"id\": \"\"","","","","","","","","","","","","","","","","","","","}","{\"id\": \"\"}"," "]
[null,null,null,null,null,null,null,null,null,null,null,null,null,null,null,null,null,null,null,null,null,null,null,null,null,null,null,null,null,"{\"id\": \"\"","","","","","","","","","","","","","","","","","","","}","{\"id\": \"\"}"," "]
[null,null,null,null,null,null,null,null,null,null,null,null,null,null,null,null,null,null,null,null,null,null,null,null,null,null,null,null,null,"{\"id\": \"\"","","","","","","","","","","","","","","","","","","","}","{\"id\": \"\"}"," "]
[null,null,null,null,null,null,null,null,null,null,null,null,null,null,null,null,null,null,null,null,null,null,null,null,null,null,null,null,null,"{\"id\": \"\"","","","","","","","","","","","","","","","","","","","}","{\"id\": \"\"}"," "]
[null,null,null,null,null,null,null,null,null,null,null,null,null,null,null,null,null,null,null,null,null,null,null,null,null,null,null,null,null,"{\"id\": \"\"","","","","","","","","","","","","","","","","","","","}","{\"id\": \"\"}"," "]
[null,null,null,null,null,null,null,null,null,null,null,null,null,null,null,null,null,null,null,null,null,null,null,null,null,null,null,null,null,"{\"id\": \"\"","","","","","","","","","","","","","","","","","","","}","{\"id\": \"\"}"," "]
[null,null,null,null,null,null,null,null,null,null,null,null,null,null,null,null,null,null,null,null,null,null,null,null,null,null,null,null,null,"{\"id\": \"\"","","","","","","","","","","","","","","","","","","","}","{\"id\": \"\"}"," "]
[null,null,null,null,null,null,null,null,null,null,null,null,null,null,null,null,null,null,null,null,null,null,null,null,null,null,null,null,null,"{\"id\": \"\"","","","","","","","","","","","","","","","","","","","}","{\"id\": \"\"}"," "]
[null,null,null,null,null,null,null,null,null,null,null,null,null,null,null,null,null,null,null,null,null,null,null,null,null,null,null,null,null,"{\"id\": \"\"","","","","","","","","","","","","","","","","","","","}","{\"id\": \"\"}"," "]
[null,null,null,null,null,null,null,null,null,null,null,null,null,null,null,null,null,null,null,null,null,null,null,null,null,null,null,null,null,"{\"id\": \"\"","","","","","","","","","","","","","","","","","","","}","{\"id\": \"\"}"," "]
[null,null,null,null,null,null,null,null,null,null,null,null,null,null,null,null,null,null,null,null,null,null,null,null,null,null,null,null,null,"{\"id\": \"\"","","","","","","","","","","","","","","","","","","","}","{\"id\": \"\"}"," "]
[null,null,null,null,null,null,null,null,null,null,null,null,null,null,null,null,null,null,null,null,null,null,null,null,null,null,null,null,null,"{\"id\": \"\"","","","","","","","","","","","","","","","","","","","}","{\"id\": \"\"}"," "]
[null,null,null,null,null,null,null,null,null,null,null,null,null,null,null,null,null,null,null,null,null,null,null,null,null,null,null,null,null,"{\"id\": \"\"","","","","","","","","","","","","","","","","","","","}","{\"id\": \"\"}"," "]
[null,null,null,null,null,null,null,null,null,null,null,null,null,null,null,null,null,null,null,null,null,null,null,null,null,null,null,null,null,"{\"id\": \"\"","","","","","","","","","","","","","","","","","","","}","{\"id\": \"\"}"," "]
[null,null,null,null,null,null,null,null,null,null,null,null,null,null,null,null,null,null,null,null,null,null,null,null,null,null,null,null,null,"{\"id\": \"\"","","","","","","","","","","","","","","","","","","","}","{\"id\": \"\"}"," "]
[null,null,null,null,null,null,null,null,null,null,null,null,null,null,null,null,null,null,null,null,null,null,null,null,null,null,null,null,null,"{\"id\": \"\"","","","","","","","","","","","","","","","","","","","}","{\"id\": \"\"}"," "]
[null,null,null,null,null,null,null,null,null,null,null,null,null,null,null,null,null,null,null,null,null,null,null,null,null,null,null,null,null,"{\"id\": \"\"","","","","","","","","","","","","","","","","","","","}","{\"id\": \"\"}"," "]
[null,null,null,null,null,null,null,null,null,null,null,null,null,null,null,null,null,null,null,null,null,null,null,null,null,null,null,null,null,"{\"id\": \"\"","","","","","","","","","","","","","","","","","","","}","{\"id\": \"\"}"," "]
[null,null,null,null,null,null,null,null,null,null,null,null,null,null,null,null,null,null,null,null,null,null,null,null,null,null,null,null,null,"{\"id\": \"\"","","","","","","","","","","","","","","","","","","","}","{\"id\": \"\"}"," "]
[null,null,null,null,null,null,null,null,null,null,null,null,null,null,null,null,null,null,null,null,null,null,null,null,null,null,null,null,null,"{\"id\": \"\"","","","","","","","","","","","","","","","","","","","}","{\"id\": \"\"}"," "]
[null,null,null,null,null,null,null,null,null,null,null,null,null,null,null,null,null,null,null,null,null,null,null,null,null,null,null,null,null,"{\"id\": \"\"","","","","","","","","","","","","","","","","","","","}","{\"id\": \"\"}"," "]
[null,null,null,null,null,null,null,null,null,null,null,null,null,null,null,null,null,null,null,null,null,null,null,null,null,null,null,null,null,"{\"id\": \"\"","","","","","","","","","","","","","","","","","","","}","{\"id\": \"\"}"," "]
[null,null,null,null,null,null,null,null,null,null,null,null,null,null,null,null,null,null,null,null,null,null,null,null,null,null,null,null,null,"{\"id\": \"\"","","","","","","","","","","","","","","","","","","","}","{\"id\": \"\"}"," "]
[null,null,null,null,null,null,null,null,null,null,null,null,null,null,null,null,null,null,null,null,null,null,null,null,null,null,null,null,null,"{\"id\": \"\"","","","","","","","","","","","","","","","","","","","}","{\"id\": \"\"}"," "]
[null,null,null,null,null,null,null,null,null,null,null,null,null,null,null,null,null,null,null,null,null,null,null,null,null,null,null,null,null,"{\"id\": \"\"","","","","","","","","","","","","","","","","","","","}","{\"id\": \"\"}"," "]
[null,null,null,null,null,null,null,null,null,null,null,null,null,null,null,null,null,null,null,null,null,null,null,null,null,null,null,null,null,"{\"id\": \"\"","","","","","","","","","","","","","","","","","","","}","{\"id\": \"\"}"," "]
[null,null,null,null,null,null,null,null,null,null,null,null,null,null,null,null,null,null,null,null,null,null,null,null,null,null,null,null,null,"{\"id\": \"\"","","","","","","","","","","","","","","","","","","","}","{\"id\": \"\"}"," "]
[null,null,null,null,null,null,null,null,null,null,null,null,null,null,null,null,null,null,null,null,null,null,null,null,null,null,null,null,null,"{\"id\": \"\"","","","","","","","","","","","","","","","","","","","}","{\"id\": \"\"}"," "]
[null,null,null,null,null,null,null,null,null,null,null,null,null,null,null,null,null,null,null,null,null,null,null,null,null,null,null,null,null,"{\"id\": \"\"","","","","","","","","","","","","","","","","","","","}","{\"id\": \"\"}"," "]
[null,null,null,null,null,null,null,null,null,null,null,null,null,null,null,null,null,null,null,null,null,null,null,null,null,null,null,null,null,"{\"id\": \"\"","","","","","","","","","","","","","","","","","","","}","{\"id\": \"\"}"," "]
[null,null,null,null,null,null,null,null,null,null,null,null,null,null,null,null,null,null,null,null,null,null,null,null,null,null,null,null,null,"{\"id\": \"\"","","","","","","","","","","","","","","","","","","","}","{\"id\": \"\"}"," "]
[null,null,null,null,null,null,null,null,null,null,null,null,null,null,null,null,null,null,null,null,null,null,null,null,null,null,null,null,null,"{\"id\": \"\"","","","","","","","","","","","","","","","","","","","}","{\"id\": \"\"}"," "]
[null,null,null,null,null,null,null,null,null,null,null,null,null,null,null,null,null,null,null,null,null,null,null,null,null,null,null,null,null,"{\"id\": \"\"","","","","","","","","","","","","","","","","","","","}","{\"id\": \"\"}"," "]
[null,null,null,null,null,null,null,null,null,null,null,null,null,null,null,null,null,null,null,null,null,null,null,null,null,null,null,null,null,"{\"id\": \"\"","","","","","","","","","","","","","","","","","","","}","{\"id\": \"\"}"," "]
[null,null,null,null,null,null,null,null,null,null,null,null,null,null,null,null,null,null,null,null,null,null,null,null,null,null,null,null,null,"{\"id\": \"\"","","","","","","","","","","","","","","","","","","","}","{\"id\": \"\"}"," "]
[null,null,null,null,null,null,null,null,null,null,null,null,null,null,null,null,null,null,null,null,null,null,null,null,null,null,null,null,null,"{\"id\": \"\"","","","","","","","","","","","","","","","","","","","}","{\"id\": \"\"}"," "]
[null,null,null,null,null,null,null,null,null,null,null,null,null,null,null,null,null,null,null,null,null,null,null,null,null,null,null,null,null,"{\"id\": \"\"","","","","","","","","","","","","","","","","","","","}","{\"id\": \"\"}"," "]
[null,null,null,null,null,null,null,null,null,null,null,null,null,null,null,null,null,null,null,null,null,null,null,null,null,null,null,null,null,"{\"id\": \"\"","","","","","","","","","","","","","","","","","","","}","{\"id\": \"\"}"," "]
[null,null,null,null,null,null,null,null,null,null,null,null,null,null,null,null,null,null,null,null,null,null,null,null,null,null,null,null,null,"{\"id\": \"\"","","","","","","","","","","","","","","","","","","","}","{\"id\": \"\"}"," "]
[null,null,null,null,null,null,null,null,null,null,null,null,null,null,null,null,null,null,null,null,null,null,null,null,null,null,null,null,null,"{\"id\": \"\"","","","","","","","","","","","","","","","","","","","}","{\"id\": \"\"}"," "]
[null,null,null,null,null,null,null,null,null,null,null,null,null,null,null,null,null,null,null,null,null,null,null,null,null,null,null,null,null,"{\"id\": \"\"","","","","","","","","","","","","","","","","","","","}","{\"id\": \"\"}"," "]
[null,null,null,null,null,null,null,null,null,null,null,null,null,null,null,null,null,null,null,null,null,null,null,null,null,null,null,null,null,"{\"id\": \"\"","","","","","","","","","","","","","","","","","","","}","{\"id\": \"\"}"," "]
[null,null,null,null,null,null,null,null,null,null,null,null,null,null,null,null,null,null,null,null,null,null,null,null,null,null,null,null,null,"{\"id\": \"\"","","","","","","","","","","","","","","","","","","","}","{\"id\": \"\"}"," "]
[null,null,null,null,null,null,null,null,null,null,null,null,null,null,null,null,null,null,null,null,null,null,null,null,null,null,null,null,null,"{\"id\": \"\"","","","","","","","","","","","","","","","","","","","}","{\"id\": \"\"}"," "]
[null,null,null,null,null,null,null,null,null,null,null,null,null,null,null,null,null,null,null,null,null,null,null,null,null,null,null,null,null,"{\"id\": \"\"","","","","","","","","","","","","","","","","","","","}","{\"id\": \"\"}"," "]
[null,null,null,null,null,null,null,null,null,null,null,null,null,null,null,null,null,null,null,null,null,null,null,null,null,null,null,null,null,"{\"id\": \"\"","","","","","","","","","","","","","","","","","","","}","{\"id\": \"\"}"," "]
[null,null,null,null,null,null,null,null,null,null,null,null,null,null,null,null,null,null,null,null,null,null,null,null,null,null,null,null,null,"{\"id\": \"\"","","","","","","","","","","","","","","","","","","","}","{\"id\": \"\"}"," "]
[null,null,null,null,null,null,null,null,null,null,null,null,null,null,null,null,null,null,null,null,null,null,null,null,null,null,null,null,null,"{\"id\": \"\"","","","","","","","","","","","","","","","","","","","}","{\"id\": \"\"}"," "]
[null,null,null,null,null,null,null,null,null,null,null,null,null,null,null,null,null,null,null,null,null,null,null,null,null,null,null,null,null,"{\"id\": \"\"","","","","","","","","","","","","","","","","","","","}","{\"id\": \"\"}"," "]
[null,null,null,null,null,null,null,null,null,null,null,null,null,null,null,null,null,null,null,null,null,null,null,null,null,null,null,null,null,"{\"id\": \"\"","","","","","","","","","","","","","","","","","","","}","{\"id\": \"\"}"," "]
[null,null,null,null,null,null,null,null,null,null,null,null,null,null,null,null,null,null,null,null,null,null,null,null,null,null,null,null,null,"{\"id\": \"\"","","","","","","","","","","","","","","","","","","","}","{\"id\": \"\"}"," "]
[null,null,null,null,null,null,null,null,null,null,null,null,null,null,null,null,null,null,null,null,null,null,null,null,null,null,null,null,null,"{\"id\": \"\"","","","","","","","","","","","","","","","","","","","}","{\"id\": \"\"}"," "]
[null,null,null,null,null,null,null,null,null,null,null,null,null,null,null,null,null,null,null,null,null,null,null,null,null,null,null,null,null,{"$f":"CONCATENATE(\"{\"\"\",A$2,\"\"\": \"\"\",A292,\"\"\"\")","v":"{\"id\": \"\""},{"$f":"IF(C292<>\"\",CONCATENATE(\",\"\"\",C$2,\"\"\":\"\"\",C292,\"\"\"\"),\"\")","v":""},{"$f":"IF(D292<>\"\",CONCATENATE(\",\"\"\",D$2,\"\"\":\"\"\",D292,\"\"\"\"),\"\")","v":""},{"$f":"IF(E292<>\"\",CONCATENATE(\",\"\"\",E$2,\"\"\":\"\"\",E292,\"\"\"\"),\"\")","v":""},{"$f":"IF(F292<>\"\",CONCATENATE(\",\"\"representations\"\":[{\"\"file\"\":\"\"\",F292,\"\"\",\"\"unit\"\":\",G292,\"}]\"),\"\")","v":""},{"$f":"IF(H292<>\"\",CONCATENATE(\",\"\"\",H$2,\"\"\":[\",H292,\",\",I292,\",\",J292,\"]\"),\"\")","v":""},{"$f":"IF(K292<>\"\",CONCATENATE(\",\"\"\",K$2,\"\"\":[\",K292,\",\",L292,\",\",M292,\"]\"),\"\")","v":""},{"$f":"IF(N292<>\"\",CONCATENATE(\",\"\"\",N$2,\"\"\":\"\"\",N292,\"\"\"\"),\"\")","v":""},{"$f":"IF(O292<>\"\",CONCATENATE(\",\"\"\",O$2,\"\"\":\"\"\",O292,\"\"\"\"),\"\")","v":""},{"$f":"IF(P292<>\"\",CONCATENATE(\",\"\"\",P$2,\"\"\":[\"\"\",P292,\"\"\"]\"),\"\")","v":""},{"$f":"IF(Q292<>\"\",CONCATENATE(\",\"\"\",Q$2,\"\"\":[\"\"\",Q292,\"\"\"]\"),\"\")","v":""},{"$f":"IF(R292<>\"\",CONCATENATE(\",\"\"\",R$2,\"\"\":[\"\"\",R292,\"\"\"]\"),\"\")","v":""},{"$f":"IF(S292<>\"\",CONCATENATE(\",\"\"\",S$2,\"\"\":\",S292),\"\")","v":""},{"$f":"IF(T292<>\"\",CONCATENATE(\",\"\"\",T$2,\"\"\":{\",T292,\"}\"),\"\")","v":""},{"$f":"IF(U292<>\"\",CONCATENATE(\",\"\"failureModes\"\":[{\"\"TTF\"\":\"\"\",U292,\"\"\",\"\"TTR\"\":\"\"\",V292,\"\"\"}\",IF(W292<>\"\",CONCATENATE(\",{\"\"TTF\"\":\"\"\",W292,\"\"\",\"\"TTR\"\":\"\"\",X292,\"\"\"}\",),\"\"),\"]\"),\"\")","v":""},{"$f":"IF(Y292<>\"\",CONCATENATE(\",\"\"\",Y$2,\"\"\":\",SUBSTITUTE(SUBSTITUTE(Y292, CHAR(10),\" \"), CHAR(9),\" \")),\"\")","v":""},{"$f":"IF(Z292<>\"\",CONCATENATE(\",\"\"\",Z$2,\"\"\":[\",Z292,\"]\"),\"\")","v":""},{"$f":"IF(AA292<>\"\",CONCATENATE(\",\"\"\",AA$2,\"\"\":\",AA292),\"\")","v":""},{"$f":"IF(AB292<>\"\",CONCATENATE(\",\"\"\",AB$2,\"\"\":[\",AB292,\"]\"),\"\")","v":""},"}",{"$f":"CONCATENATE(AD292,AE292,AF292,AG292,AH292,AI292,AJ292,AK292,AL292,AM292,AN292,AO292,AP292,AQ292,AR292,AS292,AT292,AU292,AV292,AW292)","v":"{\"id\": \"\"}"}," "]
[null,null,null,null,null,null,null,null,null,null,null,null,null,null,null,null,null,null,null,null,null,null,null,null,null,null,null,null,null,"{\"id\": \"\"","","","","","","","","","","","","","","","","","","","}","{\"id\": \"\"}"," "]
[null,null,null,null,null,null,null,null,null,null,null,null,null,null,null,null,null,null,null,null,null,null,null,null,null,null,null,null,null,"{\"id\": \"\"","","","","","","","","","","","","","","","","","","","}","{\"id\": \"\"}"," "]
[null,null,null,null,null,null,null,null,null,null,null,null,null,null,null,null,null,null,null,null,null,null,null,null,null,null,null,null,null,"{\"id\": \"\"","","","","","","","","","","","","","","","","","","","}","{\"id\": \"\"}"," "]
[null,null,null,null,null,null,null,null,null,null,null,null,null,null,null,null,null,null,null,null,null,null,null,null,null,null,null,null,null,"{\"id\": \"\"","","","","","","","","","","","","","","","","","","","}","{\"id\": \"\"}"," "]
[null,null,null,null,null,null,null,null,null,null,null,null,null,null,null,null,null,null,null,null,null,null,null,null,null,null,null,null,null,"{\"id\": \"\"","","","","","","","","","","","","","","","","","","","}","{\"id\": \"\"}"," "]
[null,null,null,null,null,null,null,null,null,null,null,null,null,null,null,null,null,null,null,null,null,null,null,null,null,null,null,null,null,"{\"id\": \"\"","","","","","","","","","","","","","","","","","","","}","{\"id\": \"\"}"," "]
[null,null,null,null,null,null,null,null,null,null,null,null,null,null,null,null,null,null,null,null,null,null,null,null,null,null,null,null,null,"{\"id\": \"\"","","","","","","","","","","","","","","","","","","","}","{\"id\": \"\"}"," "]
[null,null,null,null,null,null,null,null,null,null,null,null,null,null,null,null,null,null,null,null,null,null,null,null,null,null,null,null,null,"{\"id\": \"\"","","","","","","","","","","","","","","","","","","","}","{\"id\": \"\"}"," "]
[null,null,null,null,null,null,null,null,null,null,null,null,null,null,null,null,null,null,null,null,null,null,null,null,null,null,null,null,null,"{\"id\": \"\"","","","","","","","","","","","","","","","","","","","}","{\"id\": \"\"}"," "]
[null,null,null,null,null,null,null,null,null,null,null,null,null,null,null,null,null,null,null,null,null,null,null,null,null,null,null,null,null,"{\"id\": \"\"","","","","","","","","","","","","","","","","","","","}","{\"id\": \"\"}"," "]
[null,null,null,null,null,null,null,null,null,null,null,null,null,null,null,null,null,null,null,null,null,null,null,null,null,null,null,null,null,{"$f":"CONCATENATE(\"{\"\"\",A$2,\"\"\": \"\"\",A303,\"\"\"\")","v":"{\"id\": \"\""},{"$f":"IF(C303<>\"\",CONCATENATE(\",\"\"\",C$2,\"\"\":\"\"\",C303,\"\"\"\"),\"\")","v":""},{"$f":"IF(D303<>\"\",CONCATENATE(\",\"\"\",D$2,\"\"\":\"\"\",D303,\"\"\"\"),\"\")","v":""},{"$f":"IF(E303<>\"\",CONCATENATE(\",\"\"\",E$2,\"\"\":\"\"\",E303,\"\"\"\"),\"\")","v":""},{"$f":"IF(F303<>\"\",CONCATENATE(\",\"\"representations\"\":[{\"\"file\"\":\"\"\",F303,\"\"\",\"\"unit\"\":\",G303,\"}]\"),\"\")","v":""},{"$f":"IF(H303<>\"\",CONCATENATE(\",\"\"\",H$2,\"\"\":[\",H303,\",\",I303,\",\",J303,\"]\"),\"\")","v":""},{"$f":"IF(K303<>\"\",CONCATENATE(\",\"\"\",K$2,\"\"\":[\",K303,\",\",L303,\",\",M303,\"]\"),\"\")","v":""},{"$f":"IF(N303<>\"\",CONCATENATE(\",\"\"\",N$2,\"\"\":\"\"\",N303,\"\"\"\"),\"\")","v":""},{"$f":"IF(O303<>\"\",CONCATENATE(\",\"\"\",O$2,\"\"\":\"\"\",O303,\"\"\"\"),\"\")","v":""},{"$f":"IF(P303<>\"\",CONCATENATE(\",\"\"\",P$2,\"\"\":[\"\"\",P303,\"\"\"]\"),\"\")","v":""},{"$f":"IF(Q303<>\"\",CONCATENATE(\",\"\"\",Q$2,\"\"\":[\"\"\",Q303,\"\"\"]\"),\"\")","v":""},{"$f":"IF(R303<>\"\",CONCATENATE(\",\"\"\",R$2,\"\"\":[\"\"\",R303,\"\"\"]\"),\"\")","v":""},{"$f":"IF(S303<>\"\",CONCATENATE(\",\"\"\",S$2,\"\"\":\",S303),\"\")","v":""},{"$f":"IF(T303<>\"\",CONCATENATE(\",\"\"\",T$2,\"\"\":{\",T303,\"}\"),\"\")","v":""},{"$f":"IF(U303<>\"\",CONCATENATE(\",\"\"failureModes\"\":[{\"\"TTF\"\":\"\"\",U303,\"\"\",\"\"TTR\"\":\"\"\",V303,\"\"\"}\",IF(W303<>\"\",CONCATENATE(\",{\"\"TTF\"\":\"\"\",W303,\"\"\",\"\"TTR\"\":\"\"\",X303,\"\"\"}\",),\"\"),\"]\"),\"\")","v":""},{"$f":"IF(Y303<>\"\",CONCATENATE(\",\"\"\",Y$2,\"\"\":\",SUBSTITUTE(SUBSTITUTE(Y303, CHAR(10),\" \"), CHAR(9),\" \")),\"\")","v":""},{"$f":"IF(Z303<>\"\",CONCATENATE(\",\"\"\",Z$2,\"\"\":[\",Z303,\"]\"),\"\")","v":""},{"$f":"IF(AA303<>\"\",CONCATENATE(\",\"\"\",AA$2,\"\"\":\",AA303),\"\")","v":""},{"$f":"IF(AB303<>\"\",CONCATENATE(\",\"\"\",AB$2,\"\"\":[\",AB303,\"]\"),\"\")","v":""},"}",{"$f":"CONCATENATE(AD303,AE303,AF303,AG303,AH303,AI303,AJ303,AK303,AL303,AM303,AN303,AO303,AP303,AQ303,AR303,AS303,AT303,AU303,AV303,AW303)","v":"{\"id\": \"\"}"}," "]
[null,null,null,null,null,null,null,null,null,null,null,null,null,null,null,null,null,null,null,null,null,null,null,null,null,null,null,null,null,"{\"id\": \"\"","","","","","","","","","","","","","","","","","","","}","{\"id\": \"\"}"," "]
[null,null,null,null,null,null,null,null,null,null,null,null,null,null,null,null,null,null,null,null,null,null,null,null,null,null,null,null,null,"{\"id\": \"\"","","","","","","","","","","","","","","","","","","","}","{\"id\": \"\"}"," "]
[null,null,null,null,null,null,null,null,null,null,null,null,null,null,null,null,null,null,null,null,null,null,null,null,null,null,null,null,null,"{\"id\": \"\"","","","","","","","","","","","","","","","","","","","}","{\"id\": \"\"}"," "]
[null,null,null,null,null,null,null,null,null,null,null,null,null,null,null,null,null,null,null,null,null,null,null,null,null,null,null,null,null,"{\"id\": \"\"","","","","","","","","","","","","","","","","","","","}","{\"id\": \"\"}"," "]
[null,null,null,null,null,null,null,null,null,null,null,null,null,null,null,null,null,null,null,null,null,null,null,null,null,null,null,null,null,"{\"id\": \"\"","","","","","","","","","","","","","","","","","","","}","{\"id\": \"\"}"," "]
[null,null,null,null,null,null,null,null,null,null,null,null,null,null,null,null,null,null,null,null,null,null,null,null,null,null,null,null,null,"{\"id\": \"\"","","","","","","","","","","","","","","","","","","","}","{\"id\": \"\"}"," "]
[null,null,null,null,null,null,null,null,null,null,null,null,null,null,null,null,null,null,null,null,null,null,null,null,null,null,null,null,null,"{\"id\": \"\"","","","","","","","","","","","","","","","","","","","}","{\"id\": \"\"}"," "]
[null,null,null,null,null,null,null,null,null,null,null,null,null,null,null,null,null,null,null,null,null,null,null,null,null,null,null,null,null,"{\"id\": \"\"","","","","","","","","","","","","","","","","","","","}","{\"id\": \"\"}"," "]
[null,null,null,null,null,null,null,null,null,null,null,null,null,null,null,null,null,null,null,null,null,null,null,null,null,null,null,null,null,"{\"id\": \"\"","","","","","","","","","","","","","","","","","","","}","{\"id\": \"\"}"," "]
[null,null,null,null,null,null,null,null,null,null,null,null,null,null,null,null,null,null,null,null,null,null,null,null,null,null,null,null,null,"{\"id\": \"\"","","","","","","","","","","","","","","","","","","","}","{\"id\": \"\"}"," "]
[null,null,null,null,null,null,null,null,null,null,null,null,null,null,null,null,null,null,null,null,null,null,null,null,null,null,null,null,null,"{\"id\": \"\"","","","","","","","","","","","","","","","","","","","}","{\"id\": \"\"}"," "]
[null,null,null,null,null,null,null,null,null,null,null,null,null,null,null,null,null,null,null,null,null,null,null,null,null,null,null,null,null,"{\"id\": \"\"","","","","","","","","","","","","","","","","","","","}","{\"id\": \"\"}"," "]
[null,null,null,null,null,null,null,null,null,null,null,null,null,null,null,null,null,null,null,null,null,null,null,null,null,null,null,null,null,"{\"id\": \"\"","","","","","","","","","","","","","","","","","","","}","{\"id\": \"\"}"," "]
[null,null,null,null,null,null,null,null,null,null,null,null,null,null,null,null,null,null,null,null,null,null,null,null,null,null,null,null,null,"{\"id\": \"\"","","","","","","","","","","","","","","","","","","","}","{\"id\": \"\"}"," "]
[null,null,null,null,null,null,null,null,null,null,null,null,null,null,null,null,null,null,null,null,null,null,null,null,null,null,null,null,null,"{\"id\": \"\"","","","","","","","","","","","","","","","","","","","}","{\"id\": \"\"}"," "]
[null,null,null,null,null,null,null,null,null,null,null,null,null,null,null,null,null,null,null,null,null,null,null,null,null,null,null,null,null,"{\"id\": \"\"","","","","","","","","","","","","","","","","","","","}","{\"id\": \"\"}"," "]
[null,null,null,null,null,null,null,null,null,null,null,null,null,null,null,null,null,null,null,null,null,null,null,null,null,null,null,null,null,"{\"id\": \"\"","","","","","","","","","","","","","","","","","","","}","{\"id\": \"\"}"," "]
[null,null,null,null,null,null,null,null,null,null,null,null,null,null,null,null,null,null,null,null,null,null,null,null,null,null,null,null,null,"{\"id\": \"\"","","","","","","","","","","","","","","","","","","","}","{\"id\": \"\"}"," "]
[null,null,null,null,null,null,null,null,null,null,null,null,null,null,null,null,null,null,null,null,null,null,null,null,null,null,null,null,null,"{\"id\": \"\"","","","","","","","","","","","","","","","","","","","}","{\"id\": \"\"}"," "]
[null,null,null,null,null,null,null,null,null,null,null,null,null,null,null,null,null,null,null,null,null,null,null,null,null,null,null,null,null,"{\"id\": \"\"","","","","","","","","","","","","","","","","","","","}","{\"id\": \"\"}"," "]
[null,null,null,null,null,null,null,null,null,null,null,null,null,null,null,null,null,null,null,null,null,null,null,null,null,null,null,null,null,"{\"id\": \"\"","","","","","","","","","","","","","","","","","","","}","{\"id\": \"\"}"," "]
[null,null,null,null,null,null,null,null,null,null,null,null,null,null,null,null,null,null,null,null,null,null,null,null,null,null,null,null,null,"{\"id\": \"\"","","","","","","","","","","","","","","","","","","","}","{\"id\": \"\"}"," "]
[null,null,null,null,null,null,null,null,null,null,null,null,null,null,null,null,null,null,null,null,null,null,null,null,null,null,null,null,null,"{\"id\": \"\"","","","","","","","","","","","","","","","","","","","}","{\"id\": \"\"}"," "]
[null,null,null,null,null,null,null,null,null,null,null,null,null,null,null,null,null,null,null,null,null,null,null,null,null,null,null,null,null,"{\"id\": \"\"","","","","","","","","","","","","","","","","","","","}","{\"id\": \"\"}"," "]
[null,null,null,null,null,null,null,null,null,null,null,null,null,null,null,null,null,null,null,null,null,null,null,null,null,null,null,null,null,"{\"id\": \"\"","","","","","","","","","","","","","","","","","","","}","{\"id\": \"\"}"," "]
[null,null,null,null,null,null,null,null,null,null,null,null,null,null,null,null,null,null,null,null,null,null,null,null,null,null,null,null,null,"{\"id\": \"\"","","","","","","","","","","","","","","","","","","","}","{\"id\": \"\"}"," "]
[null,null,null,null,null,null,null,null,null,null,null,null,null,null,null,null,null,null,null,null,null,null,null,null,null,null,null,null,null,"{\"id\": \"\"","","","","","","","","","","","","","","","","","","","}","{\"id\": \"\"}"," "]
[null,null,null,null,null,null,null,null,null,null,null,null,null,null,null,null,null,null,null,null,null,null,null,null,null,null,null,null,null,"{\"id\": \"\"","","","","","","","","","","","","","","","","","","","}","{\"id\": \"\"}"," "]
[null,null,null,null,null,null,null,null,null,null,null,null,null,null,null,null,null,null,null,null,null,null,null,null,null,null,null,null,null,"{\"id\": \"\"","","","","","","","","","","","","","","","","","","","}","{\"id\": \"\"}"," "]
[null,null,null,null,null,null,null,null,null,null,null,null,null,null,null,null,null,null,null,null,null,null,null,null,null,null,null,null,null,"{\"id\": \"\"","","","","","","","","","","","","","","","","","","","}","{\"id\": \"\"}"," "]
[null,null,null,null,null,null,null,null,null,null,null,null,null,null,null,null,null,null,null,null,null,null,null,null,null,null,null,null,null,"{\"id\": \"\"","","","","","","","","","","","","","","","","","","","}","{\"id\": \"\"}"," "]
[null,null,null,null,null,null,null,null,null,null,null,null,null,null,null,null,null,null,null,null,null,null,null,null,null,null,null,null,null,"{\"id\": \"\"","","","","","","","","","","","","","","","","","","","}","{\"id\": \"\"}"," "]
[null,null,null,null,null,null,null,null,null,null,null,null,null,null,null,null,null,null,null,null,null,null,null,null,null,null,null,null,null,"{\"id\": \"\"","","","","","","","","","","","","","","","","","","","}","{\"id\": \"\"}"," "]
[null,null,null,null,null,null,null,null,null,null,null,null,null,null,null,null,null,null,null,null,null,null,null,null,null,null,null,null,null,"{\"id\": \"\"","","","","","","","","","","","","","","","","","","","}","{\"id\": \"\"}"," "]
[null,null,null,null,null,null,null,null,null,null,null,null,null,null,null,null,null,null,null,null,null,null,null,null,null,null,null,null,null,"{\"id\": \"\"","","","","","","","","","","","","","","","","","","","}","{\"id\": \"\"}"," "]
[null,null,null,null,null,null,null,null,null,null,null,null,null,null,null,null,null,null,null,null,null,null,null,null,null,null,null,null,null,"{\"id\": \"\"","","","","","","","","","","","","","","","","","","","}","{\"id\": \"\"}"," "]
[null,null,null,null,null,null,null,null,null,null,null,null,null,null,null,null,null,null,null,null,null,null,null,null,null,null,null,null,null,"{\"id\": \"\"","","","","","","","","","","","","","","","","","","","}","{\"id\": \"\"}"," "]
[null,null,null,null,null,null,null,null,null,null,null,null,null,null,null,null,null,null,null,null,null,null,null,null,null,null,null,null,null,"{\"id\": \"\"","","","","","","","","","","","","","","","","","","","}","{\"id\": \"\"}"," "]
[null,null,null,null,null,null,null,null,null,null,null,null,null,null,null,null,null,null,null,null,null,null,null,null,null,null,null,null,null,"{\"id\": \"\"","","","","","","","","","","","","","","","","","","","}","{\"id\": \"\"}"," "]
[null,null,null,null,null,null,null,null,null,null,null,null,null,null,null,null,null,null,null,null,null,null,null,null,null,null,null,null,null,"{\"id\": \"\"","","","","","","","","","","","","","","","","","","","}","{\"id\": \"\"}"," "]
[null,null,null,null,null,null,null,null,null,null,null,null,null,null,null,null,null,null,null,null,null,null,null,null,null,null,null,null,null,"{\"id\": \"\"","","","","","","","","","","","","","","","","","","","}","{\"id\": \"\"}"," "]
[null,null,null,null,null,null,null,null,null,null,null,null,null,null,null,null,null,null,null,null,null,null,null,null,null,null,null,null,null,"{\"id\": \"\"","","","","","","","","","","","","","","","","","","","}","{\"id\": \"\"}"," "]
[null,null,null,null,null,null,null,null,null,null,null,null,null,null,null,null,null,null,null,null,null,null,null,null,null,null,null,null,null,"{\"id\": \"\"","","","","","","","","","","","","","","","","","","","}","{\"id\": \"\"}"," "]
[null,null,null,null,null,null,null,null,null,null,null,null,null,null,null,null,null,null,null,null,null,null,null,null,null,null,null,null,null,"{\"id\": \"\"","","","","","","","","","","","","","","","","","","","}","{\"id\": \"\"}"," "]
[null,null,null,null,null,null,null,null,null,null,null,null,null,null,null,null,null,null,null,null,null,null,null,null,null,null,null,null,null,"{\"id\": \"\"","","","","","","","","","","","","","","","","","","","}","{\"id\": \"\"}"," "]
[null,null,null,null,null,null,null,null,null,null,null,null,null,null,null,null,null,null,null,null,null,null,null,null,null,null,null,null,null,"{\"id\": \"\"","","","","","","","","","","","","","","","","","","","}","{\"id\": \"\"}"," "]
[null,null,null,null,null,null,null,null,null,null,null,null,null,null,null,null,null,null,null,null,null,null,null,null,null,null,null,null,null,"{\"id\": \"\"","","","","","","","","","","","","","","","","","","","}","{\"id\": \"\"}"," "]
[null,null,null,null,null,null,null,null,null,null,null,null,null,null,null,null,null,null,null,null,null,null,null,null,null,null,null,null,null,"{\"id\": \"\"","","","","","","","","","","","","","","","","","","","}","{\"id\": \"\"}"," "]
[null,null,null,null,null,null,null,null,null,null,null,null,null,null,null,null,null,null,null,null,null,null,null,null,null,null,null,null,null,"{\"id\": \"\"","","","","","","","","","","","","","","","","","","","}","{\"id\": \"\"}"," "]
[null,null,null,null,null,null,null,null,null,null,null,null,null,null,null,null,null,null,null,null,null,null,null,null,null,null,null,null,null,"{\"id\": \"\"","","","","","","","","","","","","","","","","","","","}","{\"id\": \"\"}"," "]
[null,null,null,null,null,null,null,null,null,null,null,null,null,null,null,null,null,null,null,null,null,null,null,null,null,null,null,null,null,"{\"id\": \"\"","","","","","","","","","","","","","","","","","","","}","{\"id\": \"\"}"," "]
[null,null,null,null,null,null,null,null,null,null,null,null,null,null,null,null,null,null,null,null,null,null,null,null,null,null,null,null,null,"{\"id\": \"\"","","","","","","","","","","","","","","","","","","","}","{\"id\": \"\"}"," "]
[null,null,null,null,null,null,null,null,null,null,null,null,null,null,null,null,null,null,null,null,null,null,null,null,null,null,null,null,null,"{\"id\": \"\"","","","","","","","","","","","","","","","","","","","}","{\"id\": \"\"}"," "]
[null,null,null,null,null,null,null,null,null,null,null,null,null,null,null,null,null,null,null,null,null,null,null,null,null,null,null,null,null,"{\"id\": \"\"","","","","","","","","","","","","","","","","","","","}","{\"id\": \"\"}"," "]
[null,null,null,null,null,null,null,null,null,null,null,null,null,null,null,null,null,null,null,null,null,null,null,null,null,null,null,null,null,"{\"id\": \"\"","","","","","","","","","","","","","","","","","","","}","{\"id\": \"\"}"," "]
[null,null,null,null,null,null,null,null,null,null,null,null,null,null,null,null,null,null,null,null,null,null,null,null,null,null,null,null,null,"{\"id\": \"\"","","","","","","","","","","","","","","","","","","","}","{\"id\": \"\"}"," "]
[null,null,null,null,null,null,null,null,null,null,null,null,null,null,null,null,null,null,null,null,null,null,null,null,null,null,null,null,null,"{\"id\": \"\"","","","","","","","","","","","","","","","","","","","}","{\"id\": \"\"}"," "]
[null,null,null,null,null,null,null,null,null,null,null,null,null,null,null,null,null,null,null,null,null,null,null,null,null,null,null,null,null,"{\"id\": \"\"","","","","","","","","","","","","","","","","","","","}","{\"id\": \"\"}"," "]
[null,null,null,null,null,null,null,null,null,null,null,null,null,null,null,null,null,null,null,null,null,null,null,null,null,null,null,null,null,"{\"id\": \"\"","","","","","","","","","","","","","","","","","","","}","{\"id\": \"\"}"," "]
[null,null,null,null,null,null,null,null,null,null,null,null,null,null,null,null,null,null,null,null,null,null,null,null,null,null,null,null,null,"{\"id\": \"\"","","","","","","","","","","","","","","","","","","","}","{\"id\": \"\"}"," "]
[null,null,null,null,null,null,null,null,null,null,null,null,null,null,null,null,null,null,null,null,null,null,null,null,null,null,null,null,null,"{\"id\": \"\"","","","","","","","","","","","","","","","","","","","}","{\"id\": \"\"}"," "]
[null,null,null,null,null,null,null,null,null,null,null,null,null,null,null,null,null,null,null,null,null,null,null,null,null,null,null,null,null,"{\"id\": \"\"","","","","","","","","","","","","","","","","","","","}","{\"id\": \"\"}"," "]
[null,null,null,null,null,null,null,null,null,null,null,null,null,null,null,null,null,null,null,null,null,null,null,null,null,null,null,null,null,"{\"id\": \"\"","","","","","","","","","","","","","","","","","","","}","{\"id\": \"\"}"," "]
[null,null,null,null,null,null,null,null,null,null,null,null,null,null,null,null,null,null,null,null,null,null,null,null,null,null,null,null,null,{"$f":"CONCATENATE(\"{\"\"\",A$2,\"\"\": \"\"\",A367,\"\"\"\")","v":"{\"id\": \"\""},{"$f":"IF(C367<>\"\",CONCATENATE(\",\"\"\",C$2,\"\"\":\"\"\",C367,\"\"\"\"),\"\")","v":""},{"$f":"IF(D367<>\"\",CONCATENATE(\",\"\"\",D$2,\"\"\":\"\"\",D367,\"\"\"\"),\"\")","v":""},{"$f":"IF(E367<>\"\",CONCATENATE(\",\"\"\",E$2,\"\"\":\"\"\",E367,\"\"\"\"),\"\")","v":""},{"$f":"IF(F367<>\"\",CONCATENATE(\",\"\"representations\"\":[{\"\"file\"\":\"\"\",F367,\"\"\",\"\"unit\"\":\",G367,\"}]\"),\"\")","v":""},{"$f":"IF(H367<>\"\",CONCATENATE(\",\"\"\",H$2,\"\"\":[\",H367,\",\",I367,\",\",J367,\"]\"),\"\")","v":""},{"$f":"IF(K367<>\"\",CONCATENATE(\",\"\"\",K$2,\"\"\":[\",K367,\",\",L367,\",\",M367,\"]\"),\"\")","v":""},{"$f":"IF(N367<>\"\",CONCATENATE(\",\"\"\",N$2,\"\"\":\"\"\",N367,\"\"\"\"),\"\")","v":""},{"$f":"IF(O367<>\"\",CONCATENATE(\",\"\"\",O$2,\"\"\":\"\"\",O367,\"\"\"\"),\"\")","v":""},{"$f":"IF(P367<>\"\",CONCATENATE(\",\"\"\",P$2,\"\"\":[\"\"\",P367,\"\"\"]\"),\"\")","v":""},{"$f":"IF(Q367<>\"\",CONCATENATE(\",\"\"\",Q$2,\"\"\":[\"\"\",Q367,\"\"\"]\"),\"\")","v":""},{"$f":"IF(R367<>\"\",CONCATENATE(\",\"\"\",R$2,\"\"\":[\"\"\",R367,\"\"\"]\"),\"\")","v":""},{"$f":"IF(S367<>\"\",CONCATENATE(\",\"\"\",S$2,\"\"\":\",S367),\"\")","v":""},{"$f":"IF(T367<>\"\",CONCATENATE(\",\"\"\",T$2,\"\"\":{\",T367,\"}\"),\"\")","v":""},{"$f":"IF(U367<>\"\",CONCATENATE(\",\"\"failureModes\"\":[{\"\"TTF\"\":\"\"\",U367,\"\"\",\"\"TTR\"\":\"\"\",V367,\"\"\"}\",IF(W367<>\"\",CONCATENATE(\",{\"\"TTF\"\":\"\"\",W367,\"\"\",\"\"TTR\"\":\"\"\",X367,\"\"\"}\",),\"\"),\"]\"),\"\")","v":""},{"$f":"IF(Y367<>\"\",CONCATENATE(\",\"\"\",Y$2,\"\"\":\",SUBSTITUTE(SUBSTITUTE(Y367, CHAR(10),\" \"), CHAR(9),\" \")),\"\")","v":""},{"$f":"IF(Z367<>\"\",CONCATENATE(\",\"\"\",Z$2,\"\"\":[\",Z367,\"]\"),\"\")","v":""},{"$f":"IF(AA367<>\"\",CONCATENATE(\",\"\"\",AA$2,\"\"\":\",AA367),\"\")","v":""},{"$f":"IF(AB367<>\"\",CONCATENATE(\",\"\"\",AB$2,\"\"\":[\",AB367,\"]\"),\"\")","v":""},"}",{"$f":"CONCATENATE(AD367,AE367,AF367,AG367,AH367,AI367,AJ367,AK367,AL367,AM367,AN367,AO367,AP367,AQ367,AR367,AS367,AT367,AU367,AV367,AW367)","v":"{\"id\": \"\"}"}," "]
[null,null,null,null,null,null,null,null,null,null,null,null,null,null,null,null,null,null,null,null,null,null,null,null,null,null,null,null,null,"{\"id\": \"\"","","","","","","","","","","","","","","","","","","","}","{\"id\": \"\"}"," "]
[null,null,null,null,null,null,null,null,null,null,null,null,null,null,null,null,null,null,null,null,null,null,null,null,null,null,null,null,null,"{\"id\": \"\"","","","","","","","","","","","","","","","","","","","}","{\"id\": \"\"}"," "]
[null,null,null,null,null,null,null,null,null,null,null,null,null,null,null,null,null,null,null,null,null,null,null,null,null,null,null,null,null,"{\"id\": \"\"","","","","","","","","","","","","","","","","","","","}","{\"id\": \"\"}"," "]
[null,null,null,null,null,null,null,null,null,null,null,null,null,null,null,null,null,null,null,null,null,null,null,null,null,null,null,null,null,"{\"id\": \"\"","","","","","","","","","","","","","","","","","","","}","{\"id\": \"\"}"," "]
[null,null,null,null,null,null,null,null,null,null,null,null,null,null,null,null,null,null,null,null,null,null,null,null,null,null,null,null,null,"{\"id\": \"\"","","","","","","","","","","","","","","","","","","","}","{\"id\": \"\"}"," "]
[null,null,null,null,null,null,null,null,null,null,null,null,null,null,null,null,null,null,null,null,null,null,null,null,null,null,null,null,null,"{\"id\": \"\"","","","","","","","","","","","","","","","","","","","}","{\"id\": \"\"}"," "]
[null,null,null,null,null,null,null,null,null,null,null,null,null,null,null,null,null,null,null,null,null,null,null,null,null,null,null,null,null,"{\"id\": \"\"","","","","","","","","","","","","","","","","","","","}","{\"id\": \"\"}"," "]
[null,null,null,null,null,null,null,null,null,null,null,null,null,null,null,null,null,null,null,null,null,null,null,null,null,null,null,null,null,"{\"id\": \"\"","","","","","","","","","","","","","","","","","","","}","{\"id\": \"\"}"," "]
[null,null,null,null,null,null,null,null,null,null,null,null,null,null,null,null,null,null,null,null,null,null,null,null,null,null,null,null,null,"{\"id\": \"\"","","","","","","","","","","","","","","","","","","","}","{\"id\": \"\"}"," "]
[null,null,null,null,null,null,null,null,null,null,null,null,null,null,null,null,null,null,null,null,null,null,null,null,null,null,null,null,null,"{\"id\": \"\"","","","","","","","","","","","","","","","","","","","}","{\"id\": \"\"}"," "]
[null,null,null,null,null,null,null,null,null,null,null,null,null,null,null,null,null,null,null,null,null,null,null,null,null,null,null,null,null,"{\"id\": \"\"","","","","","","","","","","","","","","","","","","","}","{\"id\": \"\"}"," "]
[null,null,null,null,null,null,null,null,null,null,null,null,null,null,null,null,null,null,null,null,null,null,null,null,null,null,null,null,null,"{\"id\": \"\"","","","","","","","","","","","","","","","","","","","}","{\"id\": \"\"}"," "]
[null,null,null,null,null,null,null,null,null,null,null,null,null,null,null,null,null,null,null,null,null,null,null,null,null,null,null,null,null,"{\"id\": \"\"","","","","","","","","","","","","","","","","","","","}","{\"id\": \"\"}"," "]
[null,null,null,null,null,null,null,null,null,null,null,null,null,null,null,null,null,null,null,null,null,null,null,null,null,null,null,null,null,"{\"id\": \"\"","","","","","","","","","","","","","","","","","","","}","{\"id\": \"\"}"," "]
[null,null,null,null,null,null,null,null,null,null,null,null,null,null,null,null,null,null,null,null,null,null,null,null,null,null,null,null,null,"{\"id\": \"\"","","","","","","","","","","","","","","","","","","","}","{\"id\": \"\"}"," "]
[null,null,null,null,null,null,null,null,null,null,null,null,null,null,null,null,null,null,null,null,null,null,null,null,null,null,null,null,null,"{\"id\": \"\"","","","","","","","","","","","","","","","","","","","}","{\"id\": \"\"}"," "]
[null,null,null,null,null,null,null,null,null,null,null,null,null,null,null,null,null,null,null,null,null,null,null,null,null,null,null,null,null,"{\"id\": \"\"","","","","","","","","","","","","","","","","","","","}","{\"id\": \"\"}"," "]
[null,null,null,null,null,null,null,null,null,null,null,null,null,null,null,null,null,null,null,null,null,null,null,null,null,null,null,null,null,"{\"id\": \"\"","","","","","","","","","","","","","","","","","","","}","{\"id\": \"\"}"," "]
[null,null,null,null,null,null,null,null,null,null,null,null,null,null,null,null,null,null,null,null,null,null,null,null,null,null,null,null,null,"{\"id\": \"\"","","","","","","","","","","","","","","","","","","","}","{\"id\": \"\"}"," "]
[null,null,null,null,null,null,null,null,null,null,null,null,null,null,null,null,null,null,null,null,null,null,null,null,null,null,null,null,null,"{\"id\": \"\"","","","","","","","","","","","","","","","","","","","}","{\"id\": \"\"}"," "]
[null,null,null,null,null,null,null,null,null,null,null,null,null,null,null,null,null,null,null,null,null,null,null,null,null,null,null,null,null,"{\"id\": \"\"","","","","","","","","","","","","","","","","","","","}","{\"id\": \"\"}"," "]
[null,null,null,null,null,null,null,null,null,null,null,null,null,null,null,null,null,null,null,null,null,null,null,null,null,null,null,null,null,"{\"id\": \"\"","","","","","","","","","","","","","","","","","","","}","{\"id\": \"\"}"," "]
[null,null,null,null,null,null,null,null,null,null,null,null,null,null,null,null,null,null,null,null,null,null,null,null,null,null,null,null,null,"{\"id\": \"\"","","","","","","","","","","","","","","","","","","","}","{\"id\": \"\"}"," "]
[null,null,null,null,null,null,null,null,null,null,null,null,null,null,null,null,null,null,null,null,null,null,null,null,null,null,null,null,null,"{\"id\": \"\"","","","","","","","","","","","","","","","","","","","}","{\"id\": \"\"}"," "]
[null,null,null,null,null,null,null,null,null,null,null,null,null,null,null,null,null,null,null,null,null,null,null,null,null,null,null,null,null,"{\"id\": \"\"","","","","","","","","","","","","","","","","","","","}","{\"id\": \"\"}"," "]
[null,null,null,null,null,null,null,null,null,null,null,null,null,null,null,null,null,null,null,null,null,null,null,null,null,null,null,null,null,"{\"id\": \"\"","","","","","","","","","","","","","","","","","","","}","{\"id\": \"\"}"," "]
[null,null,null,null,null,null,null,null,null,null,null,null,null,null,null,null,null,null,null,null,null,null,null,null,null,null,null,null,null,"{\"id\": \"\"","","","","","","","","","","","","","","","","","","","}","{\"id\": \"\"}"," "]
[null,null,null,null,null,null,null,null,null,null,null,null,null,null,null,null,null,null,null,null,null,null,null,null,null,null,null,null,null,"{\"id\": \"\"","","","","","","","","","","","","","","","","","","","}","{\"id\": \"\"}"," "]
[null,null,null,null,null,null,null,null,null,null,null,null,null,null,null,null,null,null,null,null,null,null,null,null,null,null,null,null,null,"{\"id\": \"\"","","","","","","","","","","","","","","","","","","","}","{\"id\": \"\"}"," "]
[null,null,null,null,null,null,null,null,null,null,null,null,null,null,null,null,null,null,null,null,null,null,null,null,null,null,null,null,null,"{\"id\": \"\"","","","","","","","","","","","","","","","","","","","}","{\"id\": \"\"}"," "]
[null,null,null,null,null,null,null,null,null,null,null,null,null,null,null,null,null,null,null,null,null,null,null,null,null,null,null,null,null,"{\"id\": \"\"","","","","","","","","","","","","","","","","","","","}","{\"id\": \"\"}"," "]
[null,null,null,null,null,null,null,null,null,null,null,null,null,null,null,null,null,null,null,null,null,null,null,null,null,null,null,null,null,"{\"id\": \"\"","","","","","","","","","","","","","","","","","","","}","{\"id\": \"\"}"," "]
[null,null,null,null,null,null,null,null,null,null,null,null,null,null,null,null,null,null,null,null,null,null,null,null,null,null,null,null,null,"{\"id\": \"\"","","","","","","","","","","","","","","","","","","","}","{\"id\": \"\"}"," "]
[null,null,null,null,null,null,null,null,null,null,null,null,null,null,null,null,null,null,null,null,null,null,null,null,null,null,null,null,null,"{\"id\": \"\"","","","","","","","","","","","","","","","","","","","}","{\"id\": \"\"}"," "]
[null,null,null,null,null,null,null,null,null,null,null,null,null,null,null,null,null,null,null,null,null,null,null,null,null,null,null,null,null,"{\"id\": \"\"","","","","","","","","","","","","","","","","","","","}","{\"id\": \"\"}"," "]
[null,null,null,null,null,null,null,null,null,null,null,null,null,null,null,null,null,null,null,null,null,null,null,null,null,null,null,null,null,"{\"id\": \"\"","","","","","","","","","","","","","","","","","","","}","{\"id\": \"\"}"," "]
[null,null,null,null,null,null,null,null,null,null,null,null,null,null,null,null,null,null,null,null,null,null,null,null,null,null,null,null,null,"{\"id\": \"\"","","","","","","","","","","","","","","","","","","","}","{\"id\": \"\"}"," "]
[null,null,null,null,null,null,null,null,null,null,null,null,null,null,null,null,null,null,null,null,null,null,null,null,null,null,null,null,null,"{\"id\": \"\"","","","","","","","","","","","","","","","","","","","}","{\"id\": \"\"}"," "]
[null,null,null,null,null,null,null,null,null,null,null,null,null,null,null,null,null,null,null,null,null,null,null,null,null,null,null,null,null,"{\"id\": \"\"","","","","","","","","","","","","","","","","","","","}","{\"id\": \"\"}"," "]
[null,null,null,null,null,null,null,null,null,null,null,null,null,null,null,null,null,null,null,null,null,null,null,null,null,null,null,null,null,"{\"id\": \"\"","","","","","","","","","","","","","","","","","","","}","{\"id\": \"\"}"," "]
[null,null,null,null,null,null,null,null,null,null,null,null,null,null,null,null,null,null,null,null,null,null,null,null,null,null,null,null,null,"{\"id\": \"\"","","","","","","","","","","","","","","","","","","","}","{\"id\": \"\"}"," "]
[null,null,null,null,null,null,null,null,null,null,null,null,null,null,null,null,null,null,null,null,null,null,null,null,null,null,null,null,null,"{\"id\": \"\"","","","","","","","","","","","","","","","","","","","}","{\"id\": \"\"}"," "]
[null,null,null,null,null,null,null,null,null,null,null,null,null,null,null,null,null,null,null,null,null,null,null,null,null,null,null,null,null,"{\"id\": \"\"","","","","","","","","","","","","","","","","","","","}","{\"id\": \"\"}"," "]
[null,null,null,null,null,null,null,null,null,null,null,null,null,null,null,null,null,null,null,null,null,null,null,null,null,null,null,null,null,"{\"id\": \"\"","","","","","","","","","","","","","","","","","","","}","{\"id\": \"\"}"," "]
[null,null,null,null,null,null,null,null,null,null,null,null,null,null,null,null,null,null,null,null,null,null,null,null,null,null,null,null,null,"{\"id\": \"\"","","","","","","","","","","","","","","","","","","","}","{\"id\": \"\"}"," "]
[null,null,null,null,null,null,null,null,null,null,null,null,null,null,null,null,null,null,null,null,null,null,null,null,null,null,null,null,null,"{\"id\": \"\"","","","","","","","","","","","","","","","","","","","}","{\"id\": \"\"}"," "]
[null,null,null,null,null,null,null,null,null,null,null,null,null,null,null,null,null,null,null,null,null,null,null,null,null,null,null,null,null,"{\"id\": \"\"","","","","","","","","","","","","","","","","","","","}","{\"id\": \"\"}"," "]
[null,null,null,null,null,null,null,null,null,null,null,null,null,null,null,null,null,null,null,null,null,null,null,null,null,null,null,null,null,"{\"id\": \"\"","","","","","","","","","","","","","","","","","","","}","{\"id\": \"\"}"," "]
[null,null,null,null,null,null,null,null,null,null,null,null,null,null,null,null,null,null,null,null,null,null,null,null,null,null,null,null,null,"{\"id\": \"\"","","","","","","","","","","","","","","","","","","","}","{\"id\": \"\"}"," "]
[null,null,null,null,null,null,null,null,null,null,null,null,null,null,null,null,null,null,null,null,null,null,null,null,null,null,null,null,null,"{\"id\": \"\"","","","","","","","","","","","","","","","","","","","}","{\"id\": \"\"}"," "]
[null,null,null,null,null,null,null,null,null,null,null,null,null,null,null,null,null,null,null,null,null,null,null,null,null,null,null,null,null,"{\"id\": \"\"","","","","","","","","","","","","","","","","","","","}","{\"id\": \"\"}"," "]
[null,null,null,null,null,null,null,null,null,null,null,null,null,null,null,null,null,null,null,null,null,null,null,null,null,null,null,null,null,"{\"id\": \"\"","","","","","","","","","","","","","","","","","","","}","{\"id\": \"\"}"," "]
[null,null,null,null,null,null,null,null,null,null,null,null,null,null,null,null,null,null,null,null,null,null,null,null,null,null,null,null,null,"{\"id\": \"\"","","","","","","","","","","","","","","","","","","","}","{\"id\": \"\"}"," "]
[null,null,null,null,null,null,null,null,null,null,null,null,null,null,null,null,null,null,null,null,null,null,null,null,null,null,null,null,null,"{\"id\": \"\"","","","","","","","","","","","","","","","","","","","}","{\"id\": \"\"}"," "]
[null,null,null,null,null,null,null,null,null,null,null,null,null,null,null,null,null,null,null,null,null,null,null,null,null,null,null,null,null,"{\"id\": \"\"","","","","","","","","","","","","","","","","","","","}","{\"id\": \"\"}"," "]
[null,null,null,null,null,null,null,null,null,null,null,null,null,null,null,null,null,null,null,null,null,null,null,null,null,null,null,null,null,"{\"id\": \"\"","","","","","","","","","","","","","","","","","","","}","{\"id\": \"\"}"," "]
[null,null,null,null,null,null,null,null,null,null,null,null,null,null,null,null,null,null,null,null,null,null,null,null,null,null,null,null,null,"{\"id\": \"\"","","","","","","","","","","","","","","","","","","","}","{\"id\": \"\"}"," "]
[null,null,null,null,null,null,null,null,null,null,null,null,null,null,null,null,null,null,null,null,null,null,null,null,null,null,null,null,null,"{\"id\": \"\"","","","","","","","","","","","","","","","","","","","}","{\"id\": \"\"}"," "]
[null,null,null,null,null,null,null,null,null,null,null,null,null,null,null,null,null,null,null,null,null,null,null,null,null,null,null,null,null,"{\"id\": \"\"","","","","","","","","","","","","","","","","","","","}","{\"id\": \"\"}"," "]
[null,null,null,null,null,null,null,null,null,null,null,null,null,null,null,null,null,null,null,null,null,null,null,null,null,null,null,null,null,"{\"id\": \"\"","","","","","","","","","","","","","","","","","","","}","{\"id\": \"\"}"," "]
[null,null,null,null,null,null,null,null,null,null,null,null,null,null,null,null,null,null,null,null,null,null,null,null,null,null,null,null,null,"{\"id\": \"\"","","","","","","","","","","","","","","","","","","","}","{\"id\": \"\"}"," "]
[null,null,null,null,null,null,null,null,null,null,null,null,null,null,null,null,null,null,null,null,null,null,null,null,null,null,null,null,null,"{\"id\": \"\"","","","","","","","","","","","","","","","","","","","}","{\"id\": \"\"}"," "]
[null,null,null,null,null,null,null,null,null,null,null,null,null,null,null,null,null,null,null,null,null,null,null,null,null,null,null,null,null,"{\"id\": \"\"","","","","","","","","","","","","","","","","","","","}","{\"id\": \"\"}"," "]
[null,null,null,null,null,null,null,null,null,null,null,null,null,null,null,null,null,null,null,null,null,null,null,null,null,null,null,null,null,{"$f":"CONCATENATE(\"{\"\"\",A$2,\"\"\": \"\"\",A431,\"\"\"\")","v":"{\"id\": \"\""},{"$f":"IF(C431<>\"\",CONCATENATE(\",\"\"\",C$2,\"\"\":\"\"\",C431,\"\"\"\"),\"\")","v":""},{"$f":"IF(D431<>\"\",CONCATENATE(\",\"\"\",D$2,\"\"\":\"\"\",D431,\"\"\"\"),\"\")","v":""},{"$f":"IF(E431<>\"\",CONCATENATE(\",\"\"\",E$2,\"\"\":\"\"\",E431,\"\"\"\"),\"\")","v":""},{"$f":"IF(F431<>\"\",CONCATENATE(\",\"\"representations\"\":[{\"\"file\"\":\"\"\",F431,\"\"\",\"\"unit\"\":\",G431,\"}]\"),\"\")","v":""},{"$f":"IF(H431<>\"\",CONCATENATE(\",\"\"\",H$2,\"\"\":[\",H431,\",\",I431,\",\",J431,\"]\"),\"\")","v":""},{"$f":"IF(K431<>\"\",CONCATENATE(\",\"\"\",K$2,\"\"\":[\",K431,\",\",L431,\",\",M431,\"]\"),\"\")","v":""},{"$f":"IF(N431<>\"\",CONCATENATE(\",\"\"\",N$2,\"\"\":\"\"\",N431,\"\"\"\"),\"\")","v":""},{"$f":"IF(O431<>\"\",CONCATENATE(\",\"\"\",O$2,\"\"\":\"\"\",O431,\"\"\"\"),\"\")","v":""},{"$f":"IF(P431<>\"\",CONCATENATE(\",\"\"\",P$2,\"\"\":[\"\"\",P431,\"\"\"]\"),\"\")","v":""},{"$f":"IF(Q431<>\"\",CONCATENATE(\",\"\"\",Q$2,\"\"\":[\"\"\",Q431,\"\"\"]\"),\"\")","v":""},{"$f":"IF(R431<>\"\",CONCATENATE(\",\"\"\",R$2,\"\"\":[\"\"\",R431,\"\"\"]\"),\"\")","v":""},{"$f":"IF(S431<>\"\",CONCATENATE(\",\"\"\",S$2,\"\"\":\",S431),\"\")","v":""},{"$f":"IF(T431<>\"\",CONCATENATE(\",\"\"\",T$2,\"\"\":{\",T431,\"}\"),\"\")","v":""},{"$f":"IF(U431<>\"\",CONCATENATE(\",\"\"failureModes\"\":[{\"\"TTF\"\":\"\"\",U431,\"\"\",\"\"TTR\"\":\"\"\",V431,\"\"\"}\",IF(W431<>\"\",CONCATENATE(\",{\"\"TTF\"\":\"\"\",W431,\"\"\",\"\"TTR\"\":\"\"\",X431,\"\"\"}\",),\"\"),\"]\"),\"\")","v":""},{"$f":"IF(Y431<>\"\",CONCATENATE(\",\"\"\",Y$2,\"\"\":\",SUBSTITUTE(SUBSTITUTE(Y431, CHAR(10),\" \"), CHAR(9),\" \")),\"\")","v":""},{"$f":"IF(Z431<>\"\",CONCATENATE(\",\"\"\",Z$2,\"\"\":[\",Z431,\"]\"),\"\")","v":""},{"$f":"IF(AA431<>\"\",CONCATENATE(\",\"\"\",AA$2,\"\"\":\",AA431),\"\")","v":""},{"$f":"IF(AB431<>\"\",CONCATENATE(\",\"\"\",AB$2,\"\"\":[\",AB431,\"]\"),\"\")","v":""},"}",{"$f":"CONCATENATE(AD431,AE431,AF431,AG431,AH431,AI431,AJ431,AK431,AL431,AM431,AN431,AO431,AP431,AQ431,AR431,AS431,AT431,AU431,AV431,AW431)","v":"{\"id\": \"\"}"}," "]
[null,null,null,null,null,null,null,null,null,null,null,null,null,null,null,null,null,null,null,null,null,null,null,null,null,null,null,null,null,"{\"id\": \"\"","","","","","","","","","","","","","","","","","","","}","{\"id\": \"\"}"," "]
[null,null,null,null,null,null,null,null,null,null,null,null,null,null,null,null,null,null,null,null,null,null,null,null,null,null,null,null,null,"{\"id\": \"\"","","","","","","","","","","","","","","","","","","","}","{\"id\": \"\"}"," "]
[null,null,null,null,null,null,null,null,null,null,null,null,null,null,null,null,null,null,null,null,null,null,null,null,null,null,null,null,null,"{\"id\": \"\"","","","","","","","","","","","","","","","","","","","}","{\"id\": \"\"}"," "]
[null,null,null,null,null,null,null,null,null,null,null,null,null,null,null,null,null,null,null,null,null,null,null,null,null,null,null,null,null,"{\"id\": \"\"","","","","","","","","","","","","","","","","","","","}","{\"id\": \"\"}"," "]
[null,null,null,null,null,null,null,null,null,null,null,null,null,null,null,null,null,null,null,null,null,null,null,null,null,null,null,null,null,"{\"id\": \"\"","","","","","","","","","","","","","","","","","","","}","{\"id\": \"\"}"," "]
[null,null,null,null,null,null,null,null,null,null,null,null,null,null,null,null,null,null,null,null,null,null,null,null,null,null,null,null,null,"{\"id\": \"\"","","","","","","","","","","","","","","","","","","","}","{\"id\": \"\"}"," "]
[null,null,null,null,null,null,null,null,null,null,null,null,null,null,null,null,null,null,null,null,null,null,null,null,null,null,null,null,null,"{\"id\": \"\"","","","","","","","","","","","","","","","","","","","}","{\"id\": \"\"}"," "]
[null,null,null,null,null,null,null,null,null,null,null,null,null,null,null,null,null,null,null,null,null,null,null,null,null,null,null,null,null,"{\"id\": \"\"","","","","","","","","","","","","","","","","","","","}","{\"id\": \"\"}"," "]
[null,null,null,null,null,null,null,null,null,null,null,null,null,null,null,null,null,null,null,null,null,null,null,null,null,null,null,null,null,"{\"id\": \"\"","","","","","","","","","","","","","","","","","","","}","{\"id\": \"\"}"," "]
[null,null,null,null,null,null,null,null,null,null,null,null,null,null,null,null,null,null,null,null,null,null,null,null,null,null,null,null,null,"{\"id\": \"\"","","","","","","","","","","","","","","","","","","","}","{\"id\": \"\"}"," "]
[null,null,null,null,null,null,null,null,null,null,null,null,null,null,null,null,null,null,null,null,null,null,null,null,null,null,null,null,null,"{\"id\": \"\"","","","","","","","","","","","","","","","","","","","}","{\"id\": \"\"}"," "]
[null,null,null,null,null,null,null,null,null,null,null,null,null,null,null,null,null,null,null,null,null,null,null,null,null,null,null,null,null,"{\"id\": \"\"","","","","","","","","","","","","","","","","","","","}","{\"id\": \"\"}"," "]
[null,null,null,null,null,null,null,null,null,null,null,null,null,null,null,null,null,null,null,null,null,null,null,null,null,null,null,null,null,"{\"id\": \"\"","","","","","","","","","","","","","","","","","","","}","{\"id\": \"\"}"," "]
[null,null,null,null,null,null,null,null,null,null,null,null,null,null,null,null,null,null,null,null,null,null,null,null,null,null,null,null,null,"{\"id\": \"\"","","","","","","","","","","","","","","","","","","","}","{\"id\": \"\"}"," "]
[null,null,null,null,null,null,null,null,null,null,null,null,null,null,null,null,null,null,null,null,null,null,null,null,null,null,null,null,null,"{\"id\": \"\"","","","","","","","","","","","","","","","","","","","}","{\"id\": \"\"}"," "]
[null,null,null,null,null,null,null,null,null,null,null,null,null,null,null,null,null,null,null,null,null,null,null,null,null,null,null,null,null,"{\"id\": \"\"","","","","","","","","","","","","","","","","","","","}","{\"id\": \"\"}"," "]
[null,null,null,null,null,null,null,null,null,null,null,null,null,null,null,null,null,null,null,null,null,null,null,null,null,null,null,null,null,"{\"id\": \"\"","","","","","","","","","","","","","","","","","","","}","{\"id\": \"\"}"," "]
[null,null,null,null,null,null,null,null,null,null,null,null,null,null,null,null,null,null,null,null,null,null,null,null,null,null,null,null,null,"{\"id\": \"\"","","","","","","","","","","","","","","","","","","","}","{\"id\": \"\"}"," "]
[null,null,null,null,null,null,null,null,null,null,null,null,null,null,null,null,null,null,null,null,null,null,null,null,null,null,null,null,null,"{\"id\": \"\"","","","","","","","","","","","","","","","","","","","}","{\"id\": \"\"}"," "]

{"sheet":"Anim","index":2,"n_rows":1248,"n_cols":24,"rows_kept":1248,"cut":false,"hidden":false,"merged":[]}
["baseuri",null,null,null,{"$f":"Context!B2","v":"{\"context\": { \"assetTrail\": false, \"UnitOfMeasureScale\": 0.01,\"Zup\": false, \"RepoAnim\": \"\"}, \"nodes\": [], \"sequences\": [], \"bookmarks\": []}"}," "," ",{"$f":"W148","v":""}," "]
[]
["id","timestamp","eventtype","data","descr","position","rotation","placementRelTo"]
[null,null,null,null,null,null,null,null,null,"{",{"$f":"IF(A4<>\"\",CONCATENATE(\"\"\"\",A$3,\"\"\": \"\"\",$B$1,A4,\"\"\"\"),\"\")","v":""},", \"actions\": [{\"trigger\": {\"type\": \"timestamp\", \"data\": \"",{"$f":"B4*1000","v":0},"\"}, \"event\": {\"type\":",{"$f":"CONCATENATE(\"\"\"\",C4,\"\"\"\")","v":"\"\""},{"$f":"IF(D4<>\"\",CONCATENATE(\",\"\"\",D$3,\"\"\": \"\"\",D4,\"\"\"\"),\"\")","v":""},{"$f":"IF(E4<>\"\",CONCATENATE(\",\"\"\",E$3,\"\"\": \"\"\",E4,\"\"\"\"),\"\")","v":""},{"$f":"IF(F4<>\"\",CONCATENATE(\",\"\"\",F$3,\"\"\": \",F4),\"\")","v":""},{"$f":"IF(G4<>\"\",CONCATENATE(\",\"\"\",G$3,\"\"\": \",G4),\"\")","v":""},{"$f":"IF(H4<>\"\",CONCATENATE(\",\"\"\",H$3,\"\"\": \"\"\",H4,\"\"\"\"),\"\")","v":""},"} } ] }",{"$f":"IF(A4<>\"\",CONCATENATE(J4,K4,L4,M4,N4,O4,P4,Q4,R4,S4,T4,U4),\"\")","v":""},{"$f":"CONCATENATE(IF(AND(W3<>\"\",X3=\"\"),CONCATENATE(W3,IF(A4<>\"\",\",\",\"\")),\"\"),V4)","v":""}]
[null,null,null,null,null,null,null,null,null,"{",{"$f":"IF(A5<>\"\",CONCATENATE(\"\"\"\",A$3,\"\"\": \"\"\",$B$1,A5,\"\"\"\"),\"\")","v":""},", \"actions\": [{\"trigger\": {\"type\": \"timestamp\", \"data\": \"",{"$f":"B5*1000","v":0},"\"}, \"event\": {\"type\":",{"$f":"CONCATENATE(\"\"\"\",C5,\"\"\"\")","v":"\"\""},{"$f":"IF(D5<>\"\",CONCATENATE(\",\"\"\",D$3,\"\"\": \"\"\",D5,\"\"\"\"),\"\")","v":""},{"$f":"IF(E5<>\"\",CONCATENATE(\",\"\"\",E$3,\"\"\": \"\"\",E5,\"\"\"\"),\"\")","v":""},{"$f":"IF(F5<>\"\",CONCATENATE(\",\"\"\",F$3,\"\"\": \",F5),\"\")","v":""},{"$f":"IF(G5<>\"\",CONCATENATE(\",\"\"\",G$3,\"\"\": \",G5),\"\")","v":""},{"$f":"IF(H5<>\"\",CONCATENATE(\",\"\"\",H$3,\"\"\": \"\"\",H5,\"\"\"\"),\"\")","v":""},"} } ] }",{"$f":"IF(A5<>\"\",CONCATENATE(J5,K5,L5,M5,N5,O5,P5,Q5,R5,S5,T5,U5),\"\")","v":""},{"$f":"CONCATENATE(IF(AND(W4<>\"\",X4=\"\"),CONCATENATE(W4,IF(A5<>\"\",\",\",\"\")),\"\"),V5)","v":""}]
[null,null,null,null,null,null,null,null,null,"{","",", \"actions\": [{\"trigger\": {\"type\": \"timestamp\", \"data\": \"",0,"\"}, \"event\": {\"type\":","\"\"","","","","","","} } ] }","",""]
[null,null,null,null,null,null,null,null,null,"{","",", \"actions\": [{\"trigger\": {\"type\": \"timestamp\", \"data\": \"",0,"\"}, \"event\": {\"type\":","\"\"","","","","","","} } ] }","",""]
[null,null,null,null,null,null,null,null,null,"{","",", \"actions\": [{\"trigger\": {\"type\": \"timestamp\", \"data\": \"",0,"\"}, \"event\": {\"type\":","\"\"","","","","","","} } ] }","",""]
[null,null,null,null,null,null,null,null,null,"{","",", \"actions\": [{\"trigger\": {\"type\": \"timestamp\", \"data\": \"",0,"\"}, \"event\": {\"type\":","\"\"","","","","","","} } ] }","",""]
[null,null,null,null,null,null,null,null,null,"{","",", \"actions\": [{\"trigger\": {\"type\": \"timestamp\", \"data\": \"",0,"\"}, \"event\": {\"type\":","\"\"","","","","","","} } ] }","",""]
[null,null,null,null,null,null,null,null,null,"{","",", \"actions\": [{\"trigger\": {\"type\": \"timestamp\", \"data\": \"",0,"\"}, \"event\": {\"type\":","\"\"","","","","","","} } ] }","",""]
[null,null,null,null,null,null,null,null,null,"{",{"$f":"IF(A12<>\"\",CONCATENATE(\"\"\"\",A$3,\"\"\": \"\"\",$B$1,A12,\"\"\"\"),\"\")","v":""},", \"actions\": [{\"trigger\": {\"type\": \"timestamp\", \"data\": \"",{"$f":"B12*1000","v":0},"\"}, \"event\": {\"type\":",{"$f":"CONCATENATE(\"\"\"\",C12,\"\"\"\")","v":"\"\""},{"$f":"IF(D12<>\"\",CONCATENATE(\",\"\"\",D$3,\"\"\": \"\"\",D12,\"\"\"\"),\"\")","v":""},"",{"$f":"IF(F12<>\"\",CONCATENATE(\",\"\"\",F$3,\"\"\": \",F12),\"\")","v":""},"",{"$f":"IF(H12<>\"\",CONCATENATE(\",\"\"\",H$3,\"\"\": \"\"\",H12,\"\"\"\"),\"\")","v":""},"} } ] }",{"$f":"IF(A12<>\"\",CONCATENATE(J12,K12,L12,M12,N12,O12,P12,Q12,R12,S12,T12,U12),\"\")","v":""},{"$f":"CONCATENATE(IF(AND(W11<>\"\",X11=\"\"),CONCATENATE(W11,IF(A12<>\"\",\",\",\"\")),\"\"),V12)","v":""}]
[null,null,null,null,null,null,null,null,null,"{","",", \"actions\": [{\"trigger\": {\"type\": \"timestamp\", \"data\": \"",0,"\"}, \"event\": {\"type\":","\"\"","","","","","","} } ] }","",""]
[null,null,null,null,null,null,null,null,null,"{","",", \"actions\": [{\"trigger\": {\"type\": \"timestamp\", \"data\": \"",0,"\"}, \"event\": {\"type\":","\"\"","","","","","","} } ] }","",""]
[null,null,null,null,null,null,null,null,null,"{",{"$f":"IF(A15<>\"\",CONCATENATE(\"\"\"\",A$3,\"\"\": \"\"\",$B$1,A15,\"\"\"\"),\"\")","v":""},", \"actions\": [{\"trigger\": {\"type\": \"timestamp\", \"data\": \"",{"$f":"B15*1000","v":0},"\"}, \"event\": {\"type\":",{"$f":"CONCATENATE(\"\"\"\",C15,\"\"\"\")","v":"\"\""},{"$f":"IF(D15<>\"\",CONCATENATE(\",\"\"\",D$3,\"\"\": \"\"\",D15,\"\"\"\"),\"\")","v":""},{"$f":"IF(E15<>\"\",CONCATENATE(\",\"\"\",E$3,\"\"\": \"\"\",E15,\"\"\"\"),\"\")","v":""},{"$f":"IF(F15<>\"\",CONCATENATE(\",\"\"\",F$3,\"\"\": \",F15),\"\")","v":""},{"$f":"IF(G15<>\"\",CONCATENATE(\",\"\"\",G$3,\"\"\": \",G15),\"\")","v":""},{"$f":"IF(H15<>\"\",CONCATENATE(\",\"\"\",H$3,\"\"\": \"\"\",H15,\"\"\"\"),\"\")","v":""},"} } ] }",{"$f":"IF(A15<>\"\",CONCATENATE(J15,K15,L15,M15,N15,O15,P15,Q15,R15,S15,T15,U15),\"\")","v":""},{"$f":"CONCATENATE(IF(AND(W14<>\"\",X14=\"\"),CONCATENATE(W14,IF(A15<>\"\",\",\",\"\")),\"\"),V15)","v":""}]
[null,null,null,null,null,null,null,null,null,"{","",", \"actions\": [{\"trigger\": {\"type\": \"timestamp\", \"data\": \"",0,"\"}, \"event\": {\"type\":","\"\"","","","","","","} } ] }","",""]
[null,null,null,null,null,null,null,null,null,"{","",", \"actions\": [{\"trigger\": {\"type\": \"timestamp\", \"data\": \"",0,"\"}, \"event\": {\"type\":","\"\"","","","","","","} } ] }","",""]
[null,null,null,null,null,null,null,null,null,"{","",", \"actions\": [{\"trigger\": {\"type\": \"timestamp\", \"data\": \"",0,"\"}, \"event\": {\"type\":","\"\"","","","","","","} } ] }","",""]
[null,null,null,null,null,null,null,null,null,"{","",", \"actions\": [{\"trigger\": {\"type\": \"timestamp\", \"data\": \"",0,"\"}, \"event\": {\"type\":","\"\"","","","","","","} } ] }","",""]
[null,null,null,null,null,null,null,null,null,"{","",", \"actions\": [{\"trigger\": {\"type\": \"timestamp\", \"data\": \"",0,"\"}, \"event\": {\"type\":","\"\"","","","","","","} } ] }","",""]
[null,null,null,null,null,null,null,null,null,"{","",", \"actions\": [{\"trigger\": {\"type\": \"timestamp\", \"data\": \"",0,"\"}, \"event\": {\"type\":","\"\"","","","","","","} } ] }","",""]
[null,null,null,null,null,null,null,null,null,"{","",", \"actions\": [{\"trigger\": {\"type\": \"timestamp\", \"data\": \"",0,"\"}, \"event\": {\"type\":","\"\"","","","","","","} } ] }","",""]
[null,null,null,null,null,null,null,null,null,"{","",", \"actions\": [{\"trigger\": {\"type\": \"timestamp\", \"data\": \"",0,"\"}, \"event\": {\"type\":","\"\"","","","","","","} } ] }","",""]
[null,null,null,null,null,null,null,null,null,"{","",", \"actions\": [{\"trigger\": {\"type\": \"timestamp\", \"data\": \"",0,"\"}, \"event\": {\"type\":","\"\"","","","","","","} } ] }","",""]
[null,null,null,null,null,null,null,null,null,"{","",", \"actions\": [{\"trigger\": {\"type\": \"timestamp\", \"data\": \"",0,"\"}, \"event\": {\"type\":","\"\"","","","","","","} } ] }","",""]
[null,null,null,null,null,null,null,null,null,"{","",", \"actions\": [{\"trigger\": {\"type\": \"timestamp\", \"data\": \"",0,"\"}, \"event\": {\"type\":","\"\"","","","","","","} } ] }","",""]
[null,null,null,null,null,null,null,null,null,"{","",", \"actions\": [{\"trigger\": {\"type\": \"timestamp\", \"data\": \"",0,"\"}, \"event\": {\"type\":","\"\"","","","","","","} } ] }","",""]
[null,null,null,null,null,null,null,null,null,"{","",", \"actions\": [{\"trigger\": {\"type\": \"timestamp\", \"data\": \"",0,"\"}, \"event\": {\"type\":","\"\"","","","","","","} } ] }","",""]
[null,null,null,null,null,null,null,null,null,"{","",", \"actions\": [{\"trigger\": {\"type\": \"timestamp\", \"data\": \"",0,"\"}, \"event\": {\"type\":","\"\"","","","","","","} } ] }","",""]
[null,null,null,null,null,null,null,null,null,"{","",", \"actions\": [{\"trigger\": {\"type\": \"timestamp\", \"data\": \"",0,"\"}, \"event\": {\"type\":","\"\"","","","","","","} } ] }","",""]
[null,null,null,null,null,null,null,null,null,"{","",", \"actions\": [{\"trigger\": {\"type\": \"timestamp\", \"data\": \"",0,"\"}, \"event\": {\"type\":","\"\"","","","","","","} } ] }","",""]
[null,null,null,null,null,null,null,null,null,"{","",", \"actions\": [{\"trigger\": {\"type\": \"timestamp\", \"data\": \"",0,"\"}, \"event\": {\"type\":","\"\"","","","","","","} } ] }","",""]
[null,null,null,null,null,null,null,null,null,"{","",", \"actions\": [{\"trigger\": {\"type\": \"timestamp\", \"data\": \"",0,"\"}, \"event\": {\"type\":","\"\"","","","","","","} } ] }","",""]
[null,null,null,null,null,null,null,null,null,"{","",", \"actions\": [{\"trigger\": {\"type\": \"timestamp\", \"data\": \"",0,"\"}, \"event\": {\"type\":","\"\"","","","","","","} } ] }","",""]
[null,null,null,null,null,null,null,null,null,"{","",", \"actions\": [{\"trigger\": {\"type\": \"timestamp\", \"data\": \"",0,"\"}, \"event\": {\"type\":","\"\"","","","","","","} } ] }","",""]
[null,null,null,null,null,null,null,null,null,"{","",", \"actions\": [{\"trigger\": {\"type\": \"timestamp\", \"data\": \"",0,"\"}, \"event\": {\"type\":","\"\"","","","","","","} } ] }","",""]
[null,null,null,null,null,null,null,null,null,"{","",", \"actions\": [{\"trigger\": {\"type\": \"timestamp\", \"data\": \"",0,"\"}, \"event\": {\"type\":","\"\"","","","","","","} } ] }","",""]
[null,null,null,null,null,null,null,null,null,"{","",", \"actions\": [{\"trigger\": {\"type\": \"timestamp\", \"data\": \"",0,"\"}, \"event\": {\"type\":","\"\"","","","","","","} } ] }","",""]
[null,null,null,null,null,null,null,null,null,"{","",", \"actions\": [{\"trigger\": {\"type\": \"timestamp\", \"data\": \"",0,"\"}, \"event\": {\"type\":","\"\"","","","","","","} } ] }","",""]
[null,null,null,null,null,null,null,null,null,"{","",", \"actions\": [{\"trigger\": {\"type\": \"timestamp\", \"data\": \"",0,"\"}, \"event\": {\"type\":","\"\"","","","","","","} } ] }","",""]
[null,null,null,null,null,null,null,null,null,"{","",", \"actions\": [{\"trigger\": {\"type\": \"timestamp\", \"data\": \"",0,"\"}, \"event\": {\"type\":","\"\"","","","","","","} } ] }","",""]
[null,null,null,null,null,null,null,null,null,"{","",", \"actions\": [{\"trigger\": {\"type\": \"timestamp\", \"data\": \"",0,"\"}, \"event\": {\"type\":","\"\"","","","","","","} } ] }","",""]
[null,null,null,null,null,null,null,null,null,"{","",", \"actions\": [{\"trigger\": {\"type\": \"timestamp\", \"data\": \"",0,"\"}, \"event\": {\"type\":","\"\"","","","","","","} } ] }","",""]
[null,null,null,null,null,null,null,null,null,"{","",", \"actions\": [{\"trigger\": {\"type\": \"timestamp\", \"data\": \"",0,"\"}, \"event\": {\"type\":","\"\"","","","","","","} } ] }","",""]
[null,null,null,null,null,null,null,null,null,"{","",", \"actions\": [{\"trigger\": {\"type\": \"timestamp\", \"data\": \"",0,"\"}, \"event\": {\"type\":","\"\"","","","","","","} } ] }","",""]
[null,null,null,null,null,null,null,null,null,"{","",", \"actions\": [{\"trigger\": {\"type\": \"timestamp\", \"data\": \"",0,"\"}, \"event\": {\"type\":","\"\"","","","","","","} } ] }","",""]
[null,null,null,null,null,null,null,null,null,"{","",", \"actions\": [{\"trigger\": {\"type\": \"timestamp\", \"data\": \"",0,"\"}, \"event\": {\"type\":","\"\"","","","","","","} } ] }","",""]
[null,null,null,null,null,null,null,null,null,"{","",", \"actions\": [{\"trigger\": {\"type\": \"timestamp\", \"data\": \"",0,"\"}, \"event\": {\"type\":","\"\"","","","","","","} } ] }","",""]
[null,null,null,null,null,null,null,null,null,"{","",", \"actions\": [{\"trigger\": {\"type\": \"timestamp\", \"data\": \"",0,"\"}, \"event\": {\"type\":","\"\"","","","","","","} } ] }","",""]
[null,null,null,null,null,null,null,null,null,"{","",", \"actions\": [{\"trigger\": {\"type\": \"timestamp\", \"data\": \"",0,"\"}, \"event\": {\"type\":","\"\"","","","","","","} } ] }","",""]
[null,null,null,null,null,null,null,null,null,"{","",", \"actions\": [{\"trigger\": {\"type\": \"timestamp\", \"data\": \"",0,"\"}, \"event\": {\"type\":","\"\"","","","","","","} } ] }","",""]
[null,null,null,null,null,null,null,null,null,"{","",", \"actions\": [{\"trigger\": {\"type\": \"timestamp\", \"data\": \"",0,"\"}, \"event\": {\"type\":","\"\"","","","","","","} } ] }","",""]
[null,null,null,null,null,null,null,null,null,"{","",", \"actions\": [{\"trigger\": {\"type\": \"timestamp\", \"data\": \"",0,"\"}, \"event\": {\"type\":","\"\"","","","","","","} } ] }","",""]
[null,null,null,null,null,null,null,null,null,"{","",", \"actions\": [{\"trigger\": {\"type\": \"timestamp\", \"data\": \"",0,"\"}, \"event\": {\"type\":","\"\"","","","","","","} } ] }","",""]
[null,null,null,null,null,null,null,null,null,"{","",", \"actions\": [{\"trigger\": {\"type\": \"timestamp\", \"data\": \"",0,"\"}, \"event\": {\"type\":","\"\"","","","","","","} } ] }","",""]
[null,null,null,null,null,null,null,null,null,"{","",", \"actions\": [{\"trigger\": {\"type\": \"timestamp\", \"data\": \"",0,"\"}, \"event\": {\"type\":","\"\"","","","","","","} } ] }","",""]
[null,null,null,null,null,null,null,null,null,"{","",", \"actions\": [{\"trigger\": {\"type\": \"timestamp\", \"data\": \"",0,"\"}, \"event\": {\"type\":","\"\"","","","","","","} } ] }","",""]
[null,null,null,null,null,null,null,null,null,"{","",", \"actions\": [{\"trigger\": {\"type\": \"timestamp\", \"data\": \"",0,"\"}, \"event\": {\"type\":","\"\"","","","","","","} } ] }","",""]
[null,null,null,null,null,null,null,null,null,"{","",", \"actions\": [{\"trigger\": {\"type\": \"timestamp\", \"data\": \"",0,"\"}, \"event\": {\"type\":","\"\"","","","","","","} } ] }","",""]
[null,null,null,null,null,null,null,null,null,"{","",", \"actions\": [{\"trigger\": {\"type\": \"timestamp\", \"data\": \"",0,"\"}, \"event\": {\"type\":","\"\"","","","","","","} } ] }","",""]
[null,null,null,null,null,null,null,null,null,"{","",", \"actions\": [{\"trigger\": {\"type\": \"timestamp\", \"data\": \"",0,"\"}, \"event\": {\"type\":","\"\"","","","","","","} } ] }","",""]
[null,null,null,null,null,null,null,null,null,"{","",", \"actions\": [{\"trigger\": {\"type\": \"timestamp\", \"data\": \"",0,"\"}, \"event\": {\"type\":","\"\"","","","","","","} } ] }","",""]
[null,null,null,null,null,null,null,null,null,"{","",", \"actions\": [{\"trigger\": {\"type\": \"timestamp\", \"data\": \"",0,"\"}, \"event\": {\"type\":","\"\"","","","","","","} } ] }","",""]
[null,null,null,null,null,null,null,null,null,"{","",", \"actions\": [{\"trigger\": {\"type\": \"timestamp\", \"data\": \"",0,"\"}, \"event\": {\"type\":","\"\"","","","","","","} } ] }","",""]
[null,null,null,null,null,null,null,null,null,"{","",", \"actions\": [{\"trigger\": {\"type\": \"timestamp\", \"data\": \"",0,"\"}, \"event\": {\"type\":","\"\"","","","","","","} } ] }","",""]
[null,null,null,null,null,null,null,null,null,"{","",", \"actions\": [{\"trigger\": {\"type\": \"timestamp\", \"data\": \"",0,"\"}, \"event\": {\"type\":","\"\"","","","","","","} } ] }","",""]
[null,null,null,null,null,null,null,null,null,"{","",", \"actions\": [{\"trigger\": {\"type\": \"timestamp\", \"data\": \"",0,"\"}, \"event\": {\"type\":","\"\"","","","","","","} } ] }","",""]
[null,null,null,null,null,null,null,null,null,"{","",", \"actions\": [{\"trigger\": {\"type\": \"timestamp\", \"data\": \"",0,"\"}, \"event\": {\"type\":","\"\"","","","","","","} } ] }","",""]
[null,null,null,null,null,null,null,null,null,"{","",", \"actions\": [{\"trigger\": {\"type\": \"timestamp\", \"data\": \"",0,"\"}, \"event\": {\"type\":","\"\"","","","","","","} } ] }","",""]
[null,null,null,null,null,null,null,null,null,"{","",", \"actions\": [{\"trigger\": {\"type\": \"timestamp\", \"data\": \"",0,"\"}, \"event\": {\"type\":","\"\"","","","","","","} } ] }","",""]
[null,null,null,null,null,null,null,null,null,"{","",", \"actions\": [{\"trigger\": {\"type\": \"timestamp\", \"data\": \"",0,"\"}, \"event\": {\"type\":","\"\"","","","","","","} } ] }","",""]
[null,null,null,null,null,null,null,null,null,"{","",", \"actions\": [{\"trigger\": {\"type\": \"timestamp\", \"data\": \"",0,"\"}, \"event\": {\"type\":","\"\"","","","","","","} } ] }","",""]
[null,null,null,null,null,null,null,null,null,"{","",", \"actions\": [{\"trigger\": {\"type\": \"timestamp\", \"data\": \"",0,"\"}, \"event\": {\"type\":","\"\"","","","","","","} } ] }","",""]
[null,null,null,null,null,null,null,null,null,"{","",", \"actions\": [{\"trigger\": {\"type\": \"timestamp\", \"data\": \"",0,"\"}, \"event\": {\"type\":","\"\"","","","","","","} } ] }","",""]
[null,null,null,null,null,null,null,null,null,"{","",", \"actions\": [{\"trigger\": {\"type\": \"timestamp\", \"data\": \"",0,"\"}, \"event\": {\"type\":","\"\"","","","","","","} } ] }","",""]
[null,null,null,null,null,null,null,null,null,"{","",", \"actions\": [{\"trigger\": {\"type\": \"timestamp\", \"data\": \"",0,"\"}, \"event\": {\"type\":","\"\"","","","","","","} } ] }","",""]
[null,null,null,null,null,null,null,null,null,"{","",", \"actions\": [{\"trigger\": {\"type\": \"timestamp\", \"data\": \"",0,"\"}, \"event\": {\"type\":","\"\"","","","","","","} } ] }","",""]
[null,null,null,null,null,null,null,null,null,"{","",", \"actions\": [{\"trigger\": {\"type\": \"timestamp\", \"data\": \"",0,"\"}, \"event\": {\"type\":","\"\"","","","","","","} } ] }","",""]
[null,null,null,null,null,null,null,null,null,"{",{"$f":"IF(A79<>\"\",CONCATENATE(\"\"\"\",A$3,\"\"\": \"\"\",$B$1,A79,\"\"\"\"),\"\")","v":""},", \"actions\": [{\"trigger\": {\"type\": \"timestamp\", \"data\": \"",{"$f":"B79*1000","v":0},"\"}, \"event\": {\"type\":",{"$f":"CONCATENATE(\"\"\"\",C79,\"\"\"\")","v":"\"\""},{"$f":"IF(D79<>\"\",CONCATENATE(\",\"\"\",D$3,\"\"\": \"\"\",D79,\"\"\"\"),\"\")","v":""},{"$f":"IF(E79<>\"\",CONCATENATE(\",\"\"\",E$3,\"\"\": \"\"\",E79,\"\"\"\"),\"\")","v":""},{"$f":"IF(F79<>\"\",CONCATENATE(\",\"\"\",F$3,\"\"\": \",F79),\"\")","v":""},{"$f":"IF(G79<>\"\",CONCATENATE(\",\"\"\",G$3,\"\"\": \",G79),\"\")","v":""},{"$f":"IF(H79<>\"\",CONCATENATE(\",\"\"\",H$3,\"\"\": \"\"\",H79,\"\"\"\"),\"\")","v":""},"} } ] }",{"$f":"IF(A79<>\"\",CONCATENATE(J79,K79,L79,M79,N79,O79,P79,Q79,R79,S79,T79,U79),\"\")","v":""},{"$f":"CONCATENATE(IF(AND(W78<>\"\",X78=\"\"),CONCATENATE(W78,IF(A79<>\"\",\",\",\"\")),\"\"),V79)","v":""}]
[null,null,null,null,null,null,null,null,null,"{","",", \"actions\": [{\"trigger\": {\"type\": \"timestamp\", \"data\": \"",0,"\"}, \"event\": {\"type\":","\"\"","","","","","","} } ] }","",""]
[null,null,null,null,null,null,null,null,null,"{","",", \"actions\": [{\"trigger\": {\"type\": \"timestamp\", \"data\": \"",0,"\"}, \"event\": {\"type\":","\"\"","","","","","","} } ] }","",""]
[null,null,null,null,null,null,null,null,null,"{","",", \"actions\": [{\"trigger\": {\"type\": \"timestamp\", \"data\": \"",0,"\"}, \"event\": {\"type\":","\"\"","","","","","","} } ] }","",""]
[null,null,null,null,null,null,null,null,null,"{","",", \"actions\": [{\"trigger\": {\"type\": \"timestamp\", \"data\": \"",0,"\"}, \"event\": {\"type\":","\"\"","","","","","","} } ] }","",""]
[null,null,null,null,null,null,null,null,null,"{","",", \"actions\": [{\"trigger\": {\"type\": \"timestamp\", \"data\": \"",0,"\"}, \"event\": {\"type\":","\"\"","","","","","","} } ] }","",""]
[null,null,null,null,null,null,null,null,null,"{","",", \"actions\": [{\"trigger\": {\"type\": \"timestamp\", \"data\": \"",0,"\"}, \"event\": {\"type\":","\"\"","","","","","","} } ] }","",""]
[null,null,null,null,null,null,null,null,null,"{","",", \"actions\": [{\"trigger\": {\"type\": \"timestamp\", \"data\": \"",0,"\"}, \"event\": {\"type\":","\"\"","","","","","","} } ] }","",""]
[null,null,null,null,null,null,null,null,null,"{","",", \"actions\": [{\"trigger\": {\"type\": \"timestamp\", \"data\": \"",0,"\"}, \"event\": {\"type\":","\"\"","","","","","","} } ] }","",""]
[null,null,null,null,null,null,null,null,null,"{","",", \"actions\": [{\"trigger\": {\"type\": \"timestamp\", \"data\": \"",0,"\"}, \"event\": {\"type\":","\"\"","","","","","","} } ] }","",""]
[null,null,null,null,null,null,null,null,null,"{","",", \"actions\": [{\"trigger\": {\"type\": \"timestamp\", \"data\": \"",0,"\"}, \"event\": {\"type\":","\"\"","","","","","","} } ] }","",""]
[null,null,null,null,null,null,null,null,null,"{","",", \"actions\": [{\"trigger\": {\"type\": \"timestamp\", \"data\": \"",0,"\"}, \"event\": {\"type\":","\"\"","","","","","","} } ] }","",""]
[null,null,null,null,null,null,null,null,null,"{","",", \"actions\": [{\"trigger\": {\"type\": \"timestamp\", \"data\": \"",0,"\"}, \"event\": {\"type\":","\"\"","","","","","","} } ] }","",""]
[null,null,null,null,null,null,null,null,null,"{","",", \"actions\": [{\"trigger\": {\"type\": \"timestamp\", \"data\": \"",0,"\"}, \"event\": {\"type\":","\"\"","","","","","","} } ] }","",""]
[null,null,null,null,null,null,null,null,null,"{","",", \"actions\": [{\"trigger\": {\"type\": \"timestamp\", \"data\": \"",0,"\"}, \"event\": {\"type\":","\"\"","","","","","","} } ] }","",""]
[null,null,null,null,null,null,null,null,null,"{","",", \"actions\": [{\"trigger\": {\"type\": \"timestamp\", \"data\": \"",0,"\"}, \"event\": {\"type\":","\"\"","","","","","","} } ] }","",""]
[null,null,null,null,null,null,null,null,null,"{","",", \"actions\": [{\"trigger\": {\"type\": \"timestamp\", \"data\": \"",0,"\"}, \"event\": {\"type\":","\"\"","","","","","","} } ] }","",""]
[null,null,null,null,null,null,null,null,null,"{","",", \"actions\": [{\"trigger\": {\"type\": \"timestamp\", \"data\": \"",0,"\"}, \"event\": {\"type\":","\"\"","","","","","","} } ] }","",""]
[null,null,null,null,null,null,null,null,null,"{","",", \"actions\": [{\"trigger\": {\"type\": \"timestamp\", \"data\": \"",0,"\"}, \"event\": {\"type\":","\"\"","","","","","","} } ] }","",""]
[null,null,null,null,null,null,null,null,null,"{","",", \"actions\": [{\"trigger\": {\"type\": \"timestamp\", \"data\": \"",0,"\"}, \"event\": {\"type\":","\"\"","","","","","","} } ] }","",""]
[null,null,null,null,null,null,null,null,null,"{","",", \"actions\": [{\"trigger\": {\"type\": \"timestamp\", \"data\": \"",0,"\"}, \"event\": {\"type\":","\"\"","","","","","","} } ] }","",""]
[null,null,null,null,null,null,null,null,null,"{","",", \"actions\": [{\"trigger\": {\"type\": \"timestamp\", \"data\": \"",0,"\"}, \"event\": {\"type\":","\"\"","","","","","","} } ] }","",""]
[null,null,null,null,null,null,null,null,null,"{","",", \"actions\": [{\"trigger\": {\"type\": \"timestamp\", \"data\": \"",0,"\"}, \"event\": {\"type\":","\"\"","","","","","","} } ] }","",""]
[null,null,null,null,null,null,null,null,null,"{","",", \"actions\": [{\"trigger\": {\"type\": \"timestamp\", \"data\": \"",0,"\"}, \"event\": {\"type\":","\"\"","","","","","","} } ] }","",""]
[null,null,null,null,null,null,null,null,null,"{","",", \"actions\": [{\"trigger\": {\"type\": \"timestamp\", \"data\": \"",0,"\"}, \"event\": {\"type\":","\"\"","","","","","","} } ] }","",""]
[null,null,null,null,null,null,null,null,null,"{","",", \"actions\": [{\"trigger\": {\"type\": \"timestamp\", \"data\": \"",0,"\"}, \"event\": {\"type\":","\"\"","","","","","","} } ] }","",""]
[null,null,null,null,null,null,null,null,null,"{","",", \"actions\": [{\"trigger\": {\"type\": \"timestamp\", \"data\": \"",0,"\"}, \"event\": {\"type\":","\"\"","","","","","","} } ] }","",""]
[null,null,null,null,null,null,null,null,null,"{","",", \"actions\": [{\"trigger\": {\"type\": \"timestamp\", \"data\": \"",0,"\"}, \"event\": {\"type\":","\"\"","","","","","","} } ] }","",""]
[null,null,null,null,null,null,null,null,null,"{","",", \"actions\": [{\"trigger\": {\"type\": \"timestamp\", \"data\": \"",0,"\"}, \"event\": {\"type\":","\"\"","","","","","","} } ] }","",""]
[null,null,null,null,null,null,null,null,null,"{","",", \"actions\": [{\"trigger\": {\"type\": \"timestamp\", \"data\": \"",0,"\"}, \"event\": {\"type\":","\"\"","","","","","","} } ] }","",""]
[null,null,null,null,null,null,null,null,null,"{","",", \"actions\": [{\"trigger\": {\"type\": \"timestamp\", \"data\": \"",0,"\"}, \"event\": {\"type\":","\"\"","","","","","","} } ] }","",""]
[null,null,null,null,null,null,null,null,null,"{","",", \"actions\": [{\"trigger\": {\"type\": \"timestamp\", \"data\": \"",0,"\"}, \"event\": {\"type\":","\"\"","","","","","","} } ] }","",""]
[null,null,null,null,null,null,null,null,null,"{","",", \"actions\": [{\"trigger\": {\"type\": \"timestamp\", \"data\": \"",0,"\"}, \"event\": {\"type\":","\"\"","","","","","","} } ] }","",""]
[null,null,null,null,null,null,null,null,null,"{","",", \"actions\": [{\"trigger\": {\"type\": \"timestamp\", \"data\": \"",0,"\"}, \"event\": {\"type\":","\"\"","","","","","","} } ] }","",""]
[null,null,null,null,null,null,null,null,null,"{","",", \"actions\": [{\"trigger\": {\"type\": \"timestamp\", \"data\": \"",0,"\"}, \"event\": {\"type\":","\"\"","","","","","","} } ] }","",""]
[null,null,null,null,null,null,null,null,null,"{","",", \"actions\": [{\"trigger\": {\"type\": \"timestamp\", \"data\": \"",0,"\"}, \"event\": {\"type\":","\"\"","","","","","","} } ] }","",""]
[null,null,null,null,null,null,null,null,null,"{","",", \"actions\": [{\"trigger\": {\"type\": \"timestamp\", \"data\": \"",0,"\"}, \"event\": {\"type\":","\"\"","","","","","","} } ] }","",""]
[null,null,null,null,null,null,null,null,null,"{","",", \"actions\": [{\"trigger\": {\"type\": \"timestamp\", \"data\": \"",0,"\"}, \"event\": {\"type\":","\"\"","","","","","","} } ] }","",""]
[null,null,null,null,null,null,null,null,null,"{","",", \"actions\": [{\"trigger\": {\"type\": \"timestamp\", \"data\": \"",0,"\"}, \"event\": {\"type\":","\"\"","","","","","","} } ] }","",""]
[null,null,null,null,null,null,null,null,null,"{","",", \"actions\": [{\"trigger\": {\"type\": \"timestamp\", \"data\": \"",0,"\"}, \"event\": {\"type\":","\"\"","","","","","","} } ] }","",""]
[null,null,null,null,null,null,null,null,null,"{","",", \"actions\": [{\"trigger\": {\"type\": \"timestamp\", \"data\": \"",0,"\"}, \"event\": {\"type\":","\"\"","","","","","","} } ] }","",""]
[null,null,null,null,null,null,null,null,null,"{","",", \"actions\": [{\"trigger\": {\"type\": \"timestamp\", \"data\": \"",0,"\"}, \"event\": {\"type\":","\"\"","","","","","","} } ] }","",""]
[null,null,null,null,null,null,null,null,null,"{","",", \"actions\": [{\"trigger\": {\"type\": \"timestamp\", \"data\": \"",0,"\"}, \"event\": {\"type\":","\"\"","","","","","","} } ] }","",""]
[null,null,null,null,null,null,null,null,null,"{","",", \"actions\": [{\"trigger\": {\"type\": \"timestamp\", \"data\": \"",0,"\"}, \"event\": {\"type\":","\"\"","","","","","","} } ] }","",""]
[null,null,null,null,null,null,null,null,null,"{","",", \"actions\": [{\"trigger\": {\"type\": \"timestamp\", \"data\": \"",0,"\"}, \"event\": {\"type\":","\"\"","","","","","","} } ] }","",""]
[null,null,null,null,null,null,null,null,null,"{","",", \"actions\": [{\"trigger\": {\"type\": \"timestamp\", \"data\": \"",0,"\"}, \"event\": {\"type\":","\"\"","","","","","","} } ] }","",""]
[null,null,null,null,null,null,null,null,null,"{","",", \"actions\": [{\"trigger\": {\"type\": \"timestamp\", \"data\": \"",0,"\"}, \"event\": {\"type\":","\"\"","","","","","","} } ] }","",""]
[null,null,null,null,null,null,null,null,null,"{","",", \"actions\": [{\"trigger\": {\"type\": \"timestamp\", \"data\": \"",0,"\"}, \"event\": {\"type\":","\"\"","","","","","","} } ] }","",""]
[null,null,null,null,null,null,null,null,null,"{","",", \"actions\": [{\"trigger\": {\"type\": \"timestamp\", \"data\": \"",0,"\"}, \"event\": {\"type\":","\"\"","","","","","","} } ] }","",""]
[null,null,null,null,null,null,null,null,null,"{","",", \"actions\": [{\"trigger\": {\"type\": \"timestamp\", \"data\": \"",0,"\"}, \"event\": {\"type\":","\"\"","","","","","","} } ] }","",""]
[null,null,null,null,null,null,null,null,null,"{","",", \"actions\": [{\"trigger\": {\"type\": \"timestamp\", \"data\": \"",0,"\"}, \"event\": {\"type\":","\"\"","","","","","","} } ] }","",""]
[null,null,null,null,null,null,null,null,null,"{","",", \"actions\": [{\"trigger\": {\"type\": \"timestamp\", \"data\": \"",0,"\"}, \"event\": {\"type\":","\"\"","","","","","","} } ] }","",""]
[null,null,null,null,null,null,null,null,null,"{","",", \"actions\": [{\"trigger\": {\"type\": \"timestamp\", \"data\": \"",0,"\"}, \"event\": {\"type\":","\"\"","","","","","","} } ] }","",""]
[null,null,null,null,null,null,null,null,null,"{","",", \"actions\": [{\"trigger\": {\"type\": \"timestamp\", \"data\": \"",0,"\"}, \"event\": {\"type\":","\"\"","","","","","","} } ] }","",""]
[null,null,null,null,null,null,null,null,null,"{","",", \"actions\": [{\"trigger\": {\"type\": \"timestamp\", \"data\": \"",0,"\"}, \"event\": {\"type\":","\"\"","","","","","","} } ] }","",""]
[null,null,null,null,null,null,null,null,null,"{","",", \"actions\": [{\"trigger\": {\"type\": \"timestamp\", \"data\": \"",0,"\"}, \"event\": {\"type\":","\"\"","","","","","","} } ] }","",""]
[null,null,null,null,null,null,null,null,null,"{","",", \"actions\": [{\"trigger\": {\"type\": \"timestamp\", \"data\": \"",0,"\"}, \"event\": {\"type\":","\"\"","","","","","","} } ] }","",""]
[null,null,null,null,null,null,null,null,null,"{","",", \"actions\": [{\"trigger\": {\"type\": \"timestamp\", \"data\": \"",0,"\"}, \"event\": {\"type\":","\"\"","","","","","","} } ] }","",""]
[null,null,null,null,null,null,null,null,null,"{","",", \"actions\": [{\"trigger\": {\"type\": \"timestamp\", \"data\": \"",0,"\"}, \"event\": {\"type\":","\"\"","","","","","","} } ] }","",""]
[null,null,null,null,null,null,null,null,null,"{","",", \"actions\": [{\"trigger\": {\"type\": \"timestamp\", \"data\": \"",0,"\"}, \"event\": {\"type\":","\"\"","","","","","","} } ] }","",""]
[null,null,null,null,null,null,null,null,null,"{","",", \"actions\": [{\"trigger\": {\"type\": \"timestamp\", \"data\": \"",0,"\"}, \"event\": {\"type\":","\"\"","","","","","","} } ] }","",""]
[null,null,null,null,null,null,null,null,null,"{","",", \"actions\": [{\"trigger\": {\"type\": \"timestamp\", \"data\": \"",0,"\"}, \"event\": {\"type\":","\"\"","","","","","","} } ] }","",""]
[null,null,null,null,null,null,null,null,null,"{","",", \"actions\": [{\"trigger\": {\"type\": \"timestamp\", \"data\": \"",0,"\"}, \"event\": {\"type\":","\"\"","","","","","","} } ] }","",""]
[null,null,null,null,null,null,null,null,null,"{","",", \"actions\": [{\"trigger\": {\"type\": \"timestamp\", \"data\": \"",0,"\"}, \"event\": {\"type\":","\"\"","","","","","","} } ] }","",""]
[null,null,null,null,null,null,null,null,null,"{",{"$f":"IF(A143<>\"\",CONCATENATE(\"\"\"\",A$3,\"\"\": \"\"\",$B$1,A143,\"\"\"\"),\"\")","v":""},", \"actions\": [{\"trigger\": {\"type\": \"timestamp\", \"data\": \"",{"$f":"B143*1000","v":0},"\"}, \"event\": {\"type\":",{"$f":"CONCATENATE(\"\"\"\",C143,\"\"\"\")","v":"\"\""},{"$f":"IF(D143<>\"\",CONCATENATE(\",\"\"\",D$3,\"\"\": \"\"\",D143,\"\"\"\"),\"\")","v":""},{"$f":"IF(E143<>\"\",CONCATENATE(\",\"\"\",E$3,\"\"\": \"\"\",E143,\"\"\"\"),\"\")","v":""},{"$f":"IF(F143<>\"\",CONCATENATE(\",\"\"\",F$3,\"\"\": \",F143),\"\")","v":""},{"$f":"IF(G143<>\"\",CONCATENATE(\",\"\"\",G$3,\"\"\": \",G143),\"\")","v":""},{"$f":"IF(H143<>\"\",CONCATENATE(\",\"\"\",H$3,\"\"\": \"\"\",H143,\"\"\"\"),\"\")","v":""},"} } ] }",{"$f":"IF(A143<>\"\",CONCATENATE(J143,K143,L143,M143,N143,O143,P143,Q143,R143,S143,T143,U143),\"\")","v":""},{"$f":"CONCATENATE(IF(AND(W142<>\"\",X142=\"\"),CONCATENATE(W142,IF(A143<>\"\",\",\",\"\")),\"\"),V143)","v":""}]
[null,null,null,null,null,null,null,null,null,"{","",", \"actions\": [{\"trigger\": {\"type\": \"timestamp\", \"data\": \"",0,"\"}, \"event\": {\"type\":","\"\"","","","","","","} } ] }","",""]
[null,null,null,null,null,null,null,null,null,"{","",", \"actions\": [{\"trigger\": {\"type\": \"timestamp\", \"data\": \"",0,"\"}, \"event\": {\"type\":","\"\"","","","","","","} } ] }","",""]
[null,null,null,null,null,null,null,null,null,"{","",", \"actions\": [{\"trigger\": {\"type\": \"timestamp\", \"data\": \"",0,"\"}, \"event\": {\"type\":","\"\"","","","","","","} } ] }","",""]
[null,null,null,null,null,null,null,null,null,"{","",", \"actions\": [{\"trigger\": {\"type\": \"timestamp\", \"data\": \"",0,"\"}, \"event\": {\"type\":","\"\"","","","","","","} } ] }","",""]
[null,null,null,null,null,null,null,null,null,"{","",", \"actions\": [{\"trigger\": {\"type\": \"timestamp\", \"data\": \"",0,"\"}, \"event\": {\"type\":","\"\"","","","","","","} } ] }","","",1]
[null,null,null,null,null,null,null,null,null,"{","",", \"actions\": [{\"trigger\": {\"type\": \"timestamp\", \"data\": \"",0,"\"}, \"event\": {\"type\":","\"\"","","","","","","} } ] }","",""]
[null,null,null,null,null,null,null,null,null,"{","",", \"actions\": [{\"trigger\": {\"type\": \"timestamp\", \"data\": \"",0,"\"}, \"event\": {\"type\":","\"\"","","","","","","} } ] }","",""]
[null,null,null,null,null,null,null,null,null,"{","",", \"actions\": [{\"trigger\": {\"type\": \"timestamp\", \"data\": \"",0,"\"}, \"event\": {\"type\":","\"\"","","","","","","} } ] }","",""]
[null,null,null,null,null,null,null,null,null,"{","",", \"actions\": [{\"trigger\": {\"type\": \"timestamp\", \"data\": \"",0,"\"}, \"event\": {\"type\":","\"\"","","","","","","} } ] }","",""]
[null,null,null,null,null,null,null,null,null,"{","",", \"actions\": [{\"trigger\": {\"type\": \"timestamp\", \"data\": \"",0,"\"}, \"event\": {\"type\":","\"\"","","","","","","} } ] }","",""]
[null,null,null,null,null,null,null,null,null,"{","",", \"actions\": [{\"trigger\": {\"type\": \"timestamp\", \"data\": \"",0,"\"}, \"event\": {\"type\":","\"\"","","","","","","} } ] }","",""]
[null,null,null,null,null,null,null,null,null,"{","",", \"actions\": [{\"trigger\": {\"type\": \"timestamp\", \"data\": \"",0,"\"}, \"event\": {\"type\":","\"\"","","","","","","} } ] }","",""]
[null,null,null,null,null,null,null,null,null,"{","",", \"actions\": [{\"trigger\": {\"type\": \"timestamp\", \"data\": \"",0,"\"}, \"event\": {\"type\":","\"\"","","","","","","} } ] }","",""]
[null,null,null,null,null,null,null,null,null,"{","",", \"actions\": [{\"trigger\": {\"type\": \"timestamp\", \"data\": \"",0,"\"}, \"event\": {\"type\":","\"\"","","","","","","} } ] }","",""]
[null,null,null,null,null,null,null,null,null,"{","",", \"actions\": [{\"trigger\": {\"type\": \"timestamp\", \"data\": \"",0,"\"}, \"event\": {\"type\":","\"\"","","","","","","} } ] }","",""]
[null,null,null,null,null,null,null,null,null,"{","",", \"actions\": [{\"trigger\": {\"type\": \"timestamp\", \"data\": \"",0,"\"}, \"event\": {\"type\":","\"\"","","","","","","} } ] }","",""]
[null,null,null,null,null,null,null,null,null,"{","",", \"actions\": [{\"trigger\": {\"type\": \"timestamp\", \"data\": \"",0,"\"}, \"event\": {\"type\":","\"\"","","","","","","} } ] }","",""]
[null,null,null,null,null,null,null,null,null,"{","",", \"actions\": [{\"trigger\": {\"type\": \"timestamp\", \"data\": \"",0,"\"}, \"event\": {\"type\":","\"\"","","","","","","} } ] }","",""]
[null,null,null,null,null,null,null,null,null,"{","",", \"actions\": [{\"trigger\": {\"type\": \"timestamp\", \"data\": \"",0,"\"}, \"event\": {\"type\":","\"\"","","","","","","} } ] }","",""]
[null,null,null,null,null,null,null,null,null,"{","",", \"actions\": [{\"trigger\": {\"type\": \"timestamp\", \"data\": \"",0,"\"}, \"event\": {\"type\":","\"\"","","","","","","} } ] }","",""]
[null,null,null,null,null,null,null,null,null,"{","",", \"actions\": [{\"trigger\": {\"type\": \"timestamp\", \"data\": \"",0,"\"}, \"event\": {\"type\":","\"\"","","","","","","} } ] }","",""]
[null,null,null,null,null,null,null,null,null,"{","",", \"actions\": [{\"trigger\": {\"type\": \"timestamp\", \"data\": \"",0,"\"}, \"event\": {\"type\":","\"\"","","","","","","} } ] }","",""]
[null,null,null,null,null,null,null,null,null,"{","",", \"actions\": [{\"trigger\": {\"type\": \"timestamp\", \"data\": \"",0,"\"}, \"event\": {\"type\":","\"\"","","","","","","} } ] }","",""]
[null,null,null,null,null,null,null,null,null,"{","",", \"actions\": [{\"trigger\": {\"type\": \"timestamp\", \"data\": \"",0,"\"}, \"event\": {\"type\":","\"\"","","","","","","} } ] }","",""]
[null,null,null,null,null,null,null,null,null,"{","",", \"actions\": [{\"trigger\": {\"type\": \"timestamp\", \"data\": \"",0,"\"}, \"event\": {\"type\":","\"\"","","","","","","} } ] }","",""]
[null,null,null,null,null,null,null,null,null,"{","",", \"actions\": [{\"trigger\": {\"type\": \"timestamp\", \"data\": \"",0,"\"}, \"event\": {\"type\":","\"\"","","","","","","} } ] }","",""]
[null,null,null,null,null,null,null,null,null,"{","",", \"actions\": [{\"trigger\": {\"type\": \"timestamp\", \"data\": \"",0,"\"}, \"event\": {\"type\":","\"\"","","","","","","} } ] }","",""]
[null,null,null,null,null,null,null,null,null,"{","",", \"actions\": [{\"trigger\": {\"type\": \"timestamp\", \"data\": \"",0,"\"}, \"event\": {\"type\":","\"\"","","","","","","} } ] }","",""]
[null,null,null,null,null,null,null,null,null,"{","",", \"actions\": [{\"trigger\": {\"type\": \"timestamp\", \"data\": \"",0,"\"}, \"event\": {\"type\":","\"\"","","","","","","} } ] }","",""]
[null,null,null,null,null,null,null,null,null,"{","",", \"actions\": [{\"trigger\": {\"type\": \"timestamp\", \"data\": \"",0,"\"}, \"event\": {\"type\":","\"\"","","","","","","} } ] }","",""]
[null,null,null,null,null,null,null,null,null,"{","",", \"actions\": [{\"trigger\": {\"type\": \"timestamp\", \"data\": \"",0,"\"}, \"event\": {\"type\":","\"\"","","","","","","} } ] }","",""]
[null,null,null,null,null,null,null,null,null,"{","",", \"actions\": [{\"trigger\": {\"type\": \"timestamp\", \"data\": \"",0,"\"}, \"event\": {\"type\":","\"\"","","","","","","} } ] }","",""]
[null,null,null,null,null,null,null,null,null,"{","",", \"actions\": [{\"trigger\": {\"type\": \"timestamp\", \"data\": \"",0,"\"}, \"event\": {\"type\":","\"\"","","","","","","} } ] }","",""]
[null,null,null,null,null,null,null,null,null,"{","",", \"actions\": [{\"trigger\": {\"type\": \"timestamp\", \"data\": \"",0,"\"}, \"event\": {\"type\":","\"\"","","","","","","} } ] }","",""]
[null,null,null,null,null,null,null,null,null,"{","",", \"actions\": [{\"trigger\": {\"type\": \"timestamp\", \"data\": \"",0,"\"}, \"event\": {\"type\":","\"\"","","","","","","} } ] }","",""]
[null,null,null,null,null,null,null,null,null,"{","",", \"actions\": [{\"trigger\": {\"type\": \"timestamp\", \"data\": \"",0,"\"}, \"event\": {\"type\":","\"\"","","","","","","} } ] }","",""]
[null,null,null,null,null,null,null,null,null,"{","",", \"actions\": [{\"trigger\": {\"type\": \"timestamp\", \"data\": \"",0,"\"}, \"event\": {\"type\":","\"\"","","","","","","} } ] }","",""]
[null,null,null,null,null,null,null,null,null,"{","",", \"actions\": [{\"trigger\": {\"type\": \"timestamp\", \"data\": \"",0,"\"}, \"event\": {\"type\":","\"\"","","","","","","} } ] }","",""]
[null,null,null,null,null,null,null,null,null,"{","",", \"actions\": [{\"trigger\": {\"type\": \"timestamp\", \"data\": \"",0,"\"}, \"event\": {\"type\":","\"\"","","","","","","} } ] }","",""]
[null,null,null,null,null,null,null,null,null,"{","",", \"actions\": [{\"trigger\": {\"type\": \"timestamp\", \"data\": \"",0,"\"}, \"event\": {\"type\":","\"\"","","","","","","} } ] }","",""]
[null,null,null,null,null,null,null,null,null,"{","",", \"actions\": [{\"trigger\": {\"type\": \"timestamp\", \"data\": \"",0,"\"}, \"event\": {\"type\":","\"\"","","","","","","} } ] }","",""]
[null,null,null,null,null,null,null,null,null,"{","",", \"actions\": [{\"trigger\": {\"type\": \"timestamp\", \"data\": \"",0,"\"}, \"event\": {\"type\":","\"\"","","","","","","} } ] }","",""]
[null,null,null,null,null,null,null,null,null,"{","",", \"actions\": [{\"trigger\": {\"type\": \"timestamp\", \"data\": \"",0,"\"}, \"event\": {\"type\":","\"\"","","","","","","} } ] }","",""]
[null,null,null,null,null,null,null,null,null,"{","",", \"actions\": [{\"trigger\": {\"type\": \"timestamp\", \"data\": \"",0,"\"}, \"event\": {\"type\":","\"\"","","","","","","} } ] }","",""]
[null,null,null,null,null,null,null,null,null,"{","",", \"actions\": [{\"trigger\": {\"type\": \"timestamp\", \"data\": \"",0,"\"}, \"event\": {\"type\":","\"\"","","","","","","} } ] }","",""]
[null,null,null,null,null,null,null,null,null,"{","",", \"actions\": [{\"trigger\": {\"type\": \"timestamp\", \"data\": \"",0,"\"}, \"event\": {\"type\":","\"\"","","","","","","} } ] }","",""]
[null,null,null,null,null,null,null,null,null,"{","",", \"actions\": [{\"trigger\": {\"type\": \"timestamp\", \"data\": \"",0,"\"}, \"event\": {\"type\":","\"\"","","","","","","} } ] }","",""]
[null,null,null,null,null,null,null,null,null,"{","",", \"actions\": [{\"trigger\": {\"type\": \"timestamp\", \"data\": \"",0,"\"}, \"event\": {\"type\":","\"\"","","","","","","} } ] }","",""]
[null,null,null,null,null,null,null,null,null,"{","",", \"actions\": [{\"trigger\": {\"type\": \"timestamp\", \"data\": \"",0,"\"}, \"event\": {\"type\":","\"\"","","","","","","} } ] }","",""]
[null,null,null,null,null,null,null,null,null,"{","",", \"actions\": [{\"trigger\": {\"type\": \"timestamp\", \"data\": \"",0,"\"}, \"event\": {\"type\":","\"\"","","","","","","} } ] }","",""]
[null,null,null,null,null,null,null,null,null,"{","",", \"actions\": [{\"trigger\": {\"type\": \"timestamp\", \"data\": \"",0,"\"}, \"event\": {\"type\":","\"\"","","","","","","} } ] }","",""]
[null,null,null,null,null,null,null,null,null,"{","",", \"actions\": [{\"trigger\": {\"type\": \"timestamp\", \"data\": \"",0,"\"}, \"event\": {\"type\":","\"\"","","","","","","} } ] }","",""]
[null,null,null,null,null,null,null,null,null,"{","",", \"actions\": [{\"trigger\": {\"type\": \"timestamp\", \"data\": \"",0,"\"}, \"event\": {\"type\":","\"\"","","","","","","} } ] }","",""]
[null,null,null,null,null,null,null,null,null,"{","",", \"actions\": [{\"trigger\": {\"type\": \"timestamp\", \"data\": \"",0,"\"}, \"event\": {\"type\":","\"\"","","","","","","} } ] }","",""]
[null,null,null,null,null,null,null,null,null,"{","",", \"actions\": [{\"trigger\": {\"type\": \"timestamp\", \"data\": \"",0,"\"}, \"event\": {\"type\":","\"\"","","","","","","} } ] }","",""]
[null,null,null,null,null,null,null,null,null,"{","",", \"actions\": [{\"trigger\": {\"type\": \"timestamp\", \"data\": \"",0,"\"}, \"event\": {\"type\":","\"\"","","","","","","} } ] }","",""]
[null,null,null,null,null,null,null,null,null,"{","",", \"actions\": [{\"trigger\": {\"type\": \"timestamp\", \"data\": \"",0,"\"}, \"event\": {\"type\":","\"\"","","","","","","} } ] }","",""]
[null,null,null,null,null,null,null,null,null,"{","",", \"actions\": [{\"trigger\": {\"type\": \"timestamp\", \"data\": \"",0,"\"}, \"event\": {\"type\":","\"\"","","","","","","} } ] }","",""]
[null,null,null,null,null,null,null,null,null,"{","",", \"actions\": [{\"trigger\": {\"type\": \"timestamp\", \"data\": \"",0,"\"}, \"event\": {\"type\":","\"\"","","","","","","} } ] }","",""]
[null,null,null,null,null,null,null,null,null,"{","",", \"actions\": [{\"trigger\": {\"type\": \"timestamp\", \"data\": \"",0,"\"}, \"event\": {\"type\":","\"\"","","","","","","} } ] }","",""]
[null,null,null,null,null,null,null,null,null,"{","",", \"actions\": [{\"trigger\": {\"type\": \"timestamp\", \"data\": \"",0,"\"}, \"event\": {\"type\":","\"\"","","","","","","} } ] }","",""]
[null,null,null,null,null,null,null,null,null,"{","",", \"actions\": [{\"trigger\": {\"type\": \"timestamp\", \"data\": \"",0,"\"}, \"event\": {\"type\":","\"\"","","","","","","} } ] }","",""]
[null,null,null,null,null,null,null,null,null,"{","",", \"actions\": [{\"trigger\": {\"type\": \"timestamp\", \"data\": \"",0,"\"}, \"event\": {\"type\":","\"\"","","","","","","} } ] }","",""]
[null,null,null,null,null,null,null,null,null,"{",{"$f":"IF(A207<>\"\",CONCATENATE(\"\"\"\",A$3,\"\"\": \"\"\",$B$1,A207,\"\"\"\"),\"\")","v":""},", \"actions\": [{\"trigger\": {\"type\": \"timestamp\", \"data\": \"",{"$f":"B207*1000","v":0},"\"}, \"event\": {\"type\":",{"$f":"CONCATENATE(\"\"\"\",C207,\"\"\"\")","v":"\"\""},{"$f":"IF(D207<>\"\",CONCATENATE(\",\"\"\",D$3,\"\"\": \"\"\",D207,\"\"\"\"),\"\")","v":""},{"$f":"IF(E207<>\"\",CONCATENATE(\",\"\"\",E$3,\"\"\": \"\"\",E207,\"\"\"\"),\"\")","v":""},{"$f":"IF(F207<>\"\",CONCATENATE(\",\"\"\",F$3,\"\"\": \",F207),\"\")","v":""},{"$f":"IF(G207<>\"\",CONCATENATE(\",\"\"\",G$3,\"\"\": \",G207),\"\")","v":""},{"$f":"IF(H207<>\"\",CONCATENATE(\",\"\"\",H$3,\"\"\": \"\"\",H207,\"\"\"\"),\"\")","v":""},"} } ] }",{"$f":"IF(A207<>\"\",CONCATENATE(J207,K207,L207,M207,N207,O207,P207,Q207,R207,S207,T207,U207),\"\")","v":""},{"$f":"CONCATENATE(IF(AND(W206<>\"\",X206=\"\"),CONCATENATE(W206,IF(A207<>\"\",\",\",\"\")),\"\"),V207)","v":""}]
[null,null,null,null,null,null,null,null,null,"{","",", \"actions\": [{\"trigger\": {\"type\": \"timestamp\", \"data\": \"",0,"\"}, \"event\": {\"type\":","\"\"","","","","","","} } ] }","",""]
[null,null,null,null,null,null,null,null,null,"{","",", \"actions\": [{\"trigger\": {\"type\": \"timestamp\", \"data\": \"",0,"\"}, \"event\": {\"type\":","\"\"","","","","","","} } ] }","",""]
[null,null,null,null,null,null,null,null,null,"{","",", \"actions\": [{\"trigger\": {\"type\": \"timestamp\", \"data\": \"",0,"\"}, \"event\": {\"type\":","\"\"","","","","","","} } ] }","",""]
[null,null,null,null,null,null,null,null,null,"{","",", \"actions\": [{\"trigger\": {\"type\": \"timestamp\", \"data\": \"",0,"\"}, \"event\": {\"type\":","\"\"","","","","","","} } ] }","",""]
[null,null,null,null,null,null,null,null,null,"{","",", \"actions\": [{\"trigger\": {\"type\": \"timestamp\", \"data\": \"",0,"\"}, \"event\": {\"type\":","\"\"","","","","","","} } ] }","",""]
[null,null,null,null,null,null,null,null,null,"{","",", \"actions\": [{\"trigger\": {\"type\": \"timestamp\", \"data\": \"",0,"\"}, \"event\": {\"type\":","\"\"","","","","","","} } ] }","",""]
[null,null,null,null,null,null,null,null,null,"{","",", \"actions\": [{\"trigger\": {\"type\": \"timestamp\", \"data\": \"",0,"\"}, \"event\": {\"type\":","\"\"","","","","","","} } ] }","",""]
[null,null,null,null,null,null,null,null,null,"{","",", \"actions\": [{\"trigger\": {\"type\": \"timestamp\", \"data\": \"",0,"\"}, \"event\": {\"type\":","\"\"","","","","","","} } ] }","",""]
[null,null,null,null,null,null,null,null,null,"{","",", \"actions\": [{\"trigger\": {\"type\": \"timestamp\", \"data\": \"",0,"\"}, \"event\": {\"type\":","\"\"","","","","","","} } ] }","",""]
[null,null,null,null,null,null,null,null,null,"{","",", \"actions\": [{\"trigger\": {\"type\": \"timestamp\", \"data\": \"",0,"\"}, \"event\": {\"type\":","\"\"","","","","","","} } ] }","",""]
[null,null,null,null,null,null,null,null,null,"{","",", \"actions\": [{\"trigger\": {\"type\": \"timestamp\", \"data\": \"",0,"\"}, \"event\": {\"type\":","\"\"","","","","","","} } ] }","",""]
[null,null,null,null,null,null,null,null,null,"{","",", \"actions\": [{\"trigger\": {\"type\": \"timestamp\", \"data\": \"",0,"\"}, \"event\": {\"type\":","\"\"","","","","","","} } ] }","",""]
[null,null,null,null,null,null,null,null,null,"{","",", \"actions\": [{\"trigger\": {\"type\": \"timestamp\", \"data\": \"",0,"\"}, \"event\": {\"type\":","\"\"","","","","","","} } ] }","",""]
[null,null,null,null,null,null,null,null,null,"{","",", \"actions\": [{\"trigger\": {\"type\": \"timestamp\", \"data\": \"",0,"\"}, \"event\": {\"type\":","\"\"","","","","","","} } ] }","",""]
[null,null,null,null,null,null,null,null,null,"{","",", \"actions\": [{\"trigger\": {\"type\": \"timestamp\", \"data\": \"",0,"\"}, \"event\": {\"type\":","\"\"","","","","","","} } ] }","",""]
[null,null,null,null,null,null,null,null,null,"{","",", \"actions\": [{\"trigger\": {\"type\": \"timestamp\", \"data\": \"",0,"\"}, \"event\": {\"type\":","\"\"","","","","","","} } ] }","",""]
[null,null,null,null,null,null,null,null,null,"{","",", \"actions\": [{\"trigger\": {\"type\": \"timestamp\", \"data\": \"",0,"\"}, \"event\": {\"type\":","\"\"","","","","","","} } ] }","",""]
[null,null,null,null,null,null,null,null,null,"{","",", \"actions\": [{\"trigger\": {\"type\": \"timestamp\", \"data\": \"",0,"\"}, \"event\": {\"type\":","\"\"","","","","","","} } ] }","",""]
[null,null,null,null,null,null,null,null,null,"{","",", \"actions\": [{\"trigger\": {\"type\": \"timestamp\", \"data\": \"",0,"\"}, \"event\": {\"type\":","\"\"","","","","","","} } ] }","",""]
[null,null,null,null,null,null,null,null,null,"{","",", \"actions\": [{\"trigger\": {\"type\": \"timestamp\", \"data\": \"",0,"\"}, \"event\": {\"type\":","\"\"","","","","","","} } ] }","",""]
[null,null,null,null,null,null,null,null,null,"{","",", \"actions\": [{\"trigger\": {\"type\": \"timestamp\", \"data\": \"",0,"\"}, \"event\": {\"type\":","\"\"","","","","","","} } ] }","",""]
[null,null,null,null,null,null,null,null,null,"{","",", \"actions\": [{\"trigger\": {\"type\": \"timestamp\", \"data\": \"",0,"\"}, \"event\": {\"type\":","\"\"","","","","","","} } ] }","",""]
[null,null,null,null,null,null,null,null,null,"{","",", \"actions\": [{\"trigger\": {\"type\": \"timestamp\", \"data\": \"",0,"\"}, \"event\": {\"type\":","\"\"","","","","","","} } ] }","",""]
[null,null,null,null,null,null,null,null,null,"{","",", \"actions\": [{\"trigger\": {\"type\": \"timestamp\", \"data\": \"",0,"\"}, \"event\": {\"type\":","\"\"","","","","","","} } ] }","",""]
[null,null,null,null,null,null,null,null,null,"{","",", \"actions\": [{\"trigger\": {\"type\": \"timestamp\", \"data\": \"",0,"\"}, \"event\": {\"type\":","\"\"","","","","","","} } ] }","",""]
[null,null,null,null,null,null,null,null,null,"{","",", \"actions\": [{\"trigger\": {\"type\": \"timestamp\", \"data\": \"",0,"\"}, \"event\": {\"type\":","\"\"","","","","","","} } ] }","",""]
[null,null,null,null,null,null,null,null,null,"{","",", \"actions\": [{\"trigger\": {\"type\": \"timestamp\", \"data\": \"",0,"\"}, \"event\": {\"type\":","\"\"","","","","","","} } ] }","",""]
[null,null,null,null,null,null,null,null,null,"{","",", \"actions\": [{\"trigger\": {\"type\": \"timestamp\", \"data\": \"",0,"\"}, \"event\": {\"type\":","\"\"","","","","","","} } ] }","",""]
[null,null,null,null,null,null,null,null,null,"{","",", \"actions\": [{\"trigger\": {\"type\": \"timestamp\", \"data\": \"",0,"\"}, \"event\": {\"type\":","\"\"","","","","","","} } ] }","",""]
[null,null,null,null,null,null,null,null,null,"{","",", \"actions\": [{\"trigger\": {\"type\": \"timestamp\", \"data\": \"",0,"\"}, \"event\": {\"type\":","\"\"","","","","","","} } ] }","",""]
[null,null,null,null,null,null,null,null,null,"{","",", \"actions\": [{\"trigger\": {\"type\": \"timestamp\", \"data\": \"",0,"\"}, \"event\": {\"type\":","\"\"","","","","","","} } ] }","",""]
[null,null,null,null,null,null,null,null,null,"{","",", \"actions\": [{\"trigger\": {\"type\": \"timestamp\", \"data\": \"",0,"\"}, \"event\": {\"type\":","\"\"","","","","","","} } ] }","",""]
[null,null,null,null,null,null,null,null,null,"{","",", \"actions\": [{\"trigger\": {\"type\": \"timestamp\", \"data\": \"",0,"\"}, \"event\": {\"type\":","\"\"","","","","","","} } ] }","",""]
[null,null,null,null,null,null,null,null,null,"{","",", \"actions\": [{\"trigger\": {\"type\": \"timestamp\", \"data\": \"",0,"\"}, \"event\": {\"type\":","\"\"","","","","","","} } ] }","",""]
[null,null,null,null,null,null,null,null,null,"{","",", \"actions\": [{\"trigger\": {\"type\": \"timestamp\", \"data\": \"",0,"\"}, \"event\": {\"type\":","\"\"","","","","","","} } ] }","",""]
[null,null,null,null,null,null,null,null,null,"{","",", \"actions\": [{\"trigger\": {\"type\": \"timestamp\", \"data\": \"",0,"\"}, \"event\": {\"type\":","\"\"","","","","","","} } ] }","",""]
[null,null,null,null,null,null,null,null,null,"{","",", \"actions\": [{\"trigger\": {\"type\": \"timestamp\", \"data\": \"",0,"\"}, \"event\": {\"type\":","\"\"","","","","","","} } ] }","",""]
[null,null,null,null,null,null,null,null,null,"{","",", \"actions\": [{\"trigger\": {\"type\": \"timestamp\", \"data\": \"",0,"\"}, \"event\": {\"type\":","\"\"","","","","","","} } ] }","",""]
[null,null,null,null,null,null,null,null,null,"{","",", \"actions\": [{\"trigger\": {\"type\": \"timestamp\", \"data\": \"",0,"\"}, \"event\": {\"type\":","\"\"","","","","","","} } ] }","",""]
[null,null,null,null,null,null,null,null,null,"{","",", \"actions\": [{\"trigger\": {\"type\": \"timestamp\", \"data\": \"",0,"\"}, \"event\": {\"type\":","\"\"","","","","","","} } ] }","",""]
[null,null,null,null,null,null,null,null,null,"{","",", \"actions\": [{\"trigger\": {\"type\": \"timestamp\", \"data\": \"",0,"\"}, \"event\": {\"type\":","\"\"","","","","","","} } ] }","",""]
[null,null,null,null,null,null,null,null,null,"{","",", \"actions\": [{\"trigger\": {\"type\": \"timestamp\", \"data\": \"",0,"\"}, \"event\": {\"type\":","\"\"","","","","","","} } ] }","",""]
[null,null,null,null,null,null,null,null,null,"{","",", \"actions\": [{\"trigger\": {\"type\": \"timestamp\", \"data\": \"",0,"\"}, \"event\": {\"type\":","\"\"","","","","","","} } ] }","",""]
[null,null,null,null,null,null,null,null,null,"{","",", \"actions\": [{\"trigger\": {\"type\": \"timestamp\", \"data\": \"",0,"\"}, \"event\": {\"type\":","\"\"","","","","","","} } ] }","",""]
[null,null,null,null,null,null,null,null,null,"{","",", \"actions\": [{\"trigger\": {\"type\": \"timestamp\", \"data\": \"",0,"\"}, \"event\": {\"type\":","\"\"","","","","","","} } ] }","",""]
[null,null,null,null,null,null,null,null,null,"{","",", \"actions\": [{\"trigger\": {\"type\": \"timestamp\", \"data\": \"",0,"\"}, \"event\": {\"type\":","\"\"","","","","","","} } ] }","",""]
[null,null,null,null,null,null,null,null,null,"{","",", \"actions\": [{\"trigger\": {\"type\": \"timestamp\", \"data\": \"",0,"\"}, \"event\": {\"type\":","\"\"","","","","","","} } ] }","",""]
[null,null,null,null,null,null,null,null,null,"{","",", \"actions\": [{\"trigger\": {\"type\": \"timestamp\", \"data\": \"",0,"\"}, \"event\": {\"type\":","\"\"","","","","","","} } ] }","",""]
[null,null,null,null,null,null,null,null,null,"{","",", \"actions\": [{\"trigger\": {\"type\": \"timestamp\", \"data\": \"",0,"\"}, \"event\": {\"type\":","\"\"","","","","","","} } ] }","",""]
[null,null,null,null,null,null,null,null,null,"{","",", \"actions\": [{\"trigger\": {\"type\": \"timestamp\", \"data\": \"",0,"\"}, \"event\": {\"type\":","\"\"","","","","","","} } ] }","",""]
[null,null,null,null,null,null,null,null,null,"{","",", \"actions\": [{\"trigger\": {\"type\": \"timestamp\", \"data\": \"",0,"\"}, \"event\": {\"type\":","\"\"","","","","","","} } ] }","",""]
[null,null,null,null,null,null,null,null,null,"{","",", \"actions\": [{\"trigger\": {\"type\": \"timestamp\", \"data\": \"",0,"\"}, \"event\": {\"type\":","\"\"","","","","","","} } ] }","",""]
[null,null,null,null,null,null,null,null,null,"{","",", \"actions\": [{\"trigger\": {\"type\": \"timestamp\", \"data\": \"",0,"\"}, \"event\": {\"type\":","\"\"","","","","","","} } ] }","",""]
[null,null,null,null,null,null,null,null,null,"{","",", \"actions\": [{\"trigger\": {\"type\": \"timestamp\", \"data\": \"",0,"\"}, \"event\": {\"type\":","\"\"","","","","","","} } ] }","",""]
[null,null,null,null,null,null,null,null,null,"{","",", \"actions\": [{\"trigger\": {\"type\": \"timestamp\", \"data\": \"",0,"\"}, \"event\": {\"type\":","\"\"","","","","","","} } ] }","",""]
[null,null,null,null,null,null,null,null,null,"{","",", \"actions\": [{\"trigger\": {\"type\": \"timestamp\", \"data\": \"",0,"\"}, \"event\": {\"type\":","\"\"","","","","","","} } ] }","",""]
[null,null,null,null,null,null,null,null,null,"{","",", \"actions\": [{\"trigger\": {\"type\": \"timestamp\", \"data\": \"",0,"\"}, \"event\": {\"type\":","\"\"","","","","","","} } ] }","",""]
[null,null,null,null,null,null,null,null,null,"{","",", \"actions\": [{\"trigger\": {\"type\": \"timestamp\", \"data\": \"",0,"\"}, \"event\": {\"type\":","\"\"","","","","","","} } ] }","",""]
[null,null,null,null,null,null,null,null,null,"{","",", \"actions\": [{\"trigger\": {\"type\": \"timestamp\", \"data\": \"",0,"\"}, \"event\": {\"type\":","\"\"","","","","","","} } ] }","",""]
[null,null,null,null,null,null,null,null,null,"{","",", \"actions\": [{\"trigger\": {\"type\": \"timestamp\", \"data\": \"",0,"\"}, \"event\": {\"type\":","\"\"","","","","","","} } ] }","",""]
[null,null,null,null,null,null,null,null,null,"{","",", \"actions\": [{\"trigger\": {\"type\": \"timestamp\", \"data\": \"",0,"\"}, \"event\": {\"type\":","\"\"","","","","","","} } ] }","",""]
[null,null,null,null,null,null,null,null,null,"{","",", \"actions\": [{\"trigger\": {\"type\": \"timestamp\", \"data\": \"",0,"\"}, \"event\": {\"type\":","\"\"","","","","","","} } ] }","",""]
[null,null,null,null,null,null,null,null,null,"{","",", \"actions\": [{\"trigger\": {\"type\": \"timestamp\", \"data\": \"",0,"\"}, \"event\": {\"type\":","\"\"","","","","","","} } ] }","",""]
[null,null,null,null,null,null,null,null,null,"{",{"$f":"IF(A271<>\"\",CONCATENATE(\"\"\"\",A$3,\"\"\": \"\"\",$B$1,A271,\"\"\"\"),\"\")","v":""},", \"actions\": [{\"trigger\": {\"type\": \"timestamp\", \"data\": \"",{"$f":"B271*1000","v":0},"\"}, \"event\": {\"type\":",{"$f":"CONCATENATE(\"\"\"\",C271,\"\"\"\")","v":"\"\""},{"$f":"IF(D271<>\"\",CONCATENATE(\",\"\"\",D$3,\"\"\": \"\"\",D271,\"\"\"\"),\"\")","v":""},{"$f":"IF(E271<>\"\",CONCATENATE(\",\"\"\",E$3,\"\"\": \"\"\",E271,\"\"\"\"),\"\")","v":""},{"$f":"IF(F271<>\"\",CONCATENATE(\",\"\"\",F$3,\"\"\": \",F271),\"\")","v":""},{"$f":"IF(G271<>\"\",CONCATENATE(\",\"\"\",G$3,\"\"\": \",G271),\"\")","v":""},{"$f":"IF(H271<>\"\",CONCATENATE(\",\"\"\",H$3,\"\"\": \"\"\",H271,\"\"\"\"),\"\")","v":""},"} } ] }",{"$f":"IF(A271<>\"\",CONCATENATE(J271,K271,L271,M271,N271,O271,P271,Q271,R271,S271,T271,U271),\"\")","v":""},{"$f":"CONCATENATE(IF(AND(W270<>\"\",X270=\"\"),CONCATENATE(W270,IF(A271<>\"\",\",\",\"\")),\"\"),V271)","v":""}]
[null,null,null,null,null,null,null,null,null,"{","",", \"actions\": [{\"trigger\": {\"type\": \"timestamp\", \"data\": \"",0,"\"}, \"event\": {\"type\":","\"\"","","","","","","} } ] }","",""]
[null,null,null,null,null,null,null,null,null,"{","",", \"actions\": [{\"trigger\": {\"type\": \"timestamp\", \"data\": \"",0,"\"}, \"event\": {\"type\":","\"\"","","","","","","} } ] }","",""]
[null,null,null,null,null,null,null,null,null,"{","",", \"actions\": [{\"trigger\": {\"type\": \"timestamp\", \"data\": \"",0,"\"}, \"event\": {\"type\":","\"\"","","","","","","} } ] }","",""]
[null,null,null,null,null,null,null,null,null,"{","",", \"actions\": [{\"trigger\": {\"type\": \"timestamp\", \"data\": \"",0,"\"}, \"event\": {\"type\":","\"\"","","","","","","} } ] }","",""]
[null,null,null,null,null,null,null,null,null,"{","",", \"actions\": [{\"trigger\": {\"type\": \"timestamp\", \"data\": \"",0,"\"}, \"event\": {\"type\":","\"\"","","","","","","} } ] }","",""]
[null,null,null,null,null,null,null,null,null,"{","",", \"actions\": [{\"trigger\": {\"type\": \"timestamp\", \"data\": \"",0,"\"}, \"event\": {\"type\":","\"\"","","","","","","} } ] }","",""]
[null,null,null,null,null,null,null,null,null,"{","",", \"actions\": [{\"trigger\": {\"type\": \"timestamp\", \"data\": \"",0,"\"}, \"event\": {\"type\":","\"\"","","","","","","} } ] }","",""]
[null,null,null,null,null,null,null,null,null,"{","",", \"actions\": [{\"trigger\": {\"type\": \"timestamp\", \"data\": \"",0,"\"}, \"event\": {\"type\":","\"\"","","","","","","} } ] }","",""]
[null,null,null,null,null,null,null,null,null,"{","",", \"actions\": [{\"trigger\": {\"type\": \"timestamp\", \"data\": \"",0,"\"}, \"event\": {\"type\":","\"\"","","","","","","} } ] }","",""]
[null,null,null,null,null,null,null,null,null,"{","",", \"actions\": [{\"trigger\": {\"type\": \"timestamp\", \"data\": \"",0,"\"}, \"event\": {\"type\":","\"\"","","","","","","} } ] }","",""]
[null,null,null,null,null,null,null,null,null,"{","",", \"actions\": [{\"trigger\": {\"type\": \"timestamp\", \"data\": \"",0,"\"}, \"event\": {\"type\":","\"\"","","","","","","} } ] }","",""]
[null,null,null,null,null,null,null,null,null,"{","",", \"actions\": [{\"trigger\": {\"type\": \"timestamp\", \"data\": \"",0,"\"}, \"event\": {\"type\":","\"\"","","","","","","} } ] }","",""]
[null,null,null,null,null,null,null,null,null,"{","",", \"actions\": [{\"trigger\": {\"type\": \"timestamp\", \"data\": \"",0,"\"}, \"event\": {\"type\":","\"\"","","","","","","} } ] }","",""]
[null,null,null,null,null,null,null,null,null,"{","",", \"actions\": [{\"trigger\": {\"type\": \"timestamp\", \"data\": \"",0,"\"}, \"event\": {\"type\":","\"\"","","","","","","} } ] }","",""]
[null,null,null,null,null,null,null,null,null,"{","",", \"actions\": [{\"trigger\": {\"type\": \"timestamp\", \"data\": \"",0,"\"}, \"event\": {\"type\":","\"\"","","","","","","} } ] }","",""]
[null,null,null,null,null,null,null,null,null,"{","",", \"actions\": [{\"trigger\": {\"type\": \"timestamp\", \"data\": \"",0,"\"}, \"event\": {\"type\":","\"\"","","","","","","} } ] }","",""]
[null,null,null,null,null,null,null,null,null,"{","",", \"actions\": [{\"trigger\": {\"type\": \"timestamp\", \"data\": \"",0,"\"}, \"event\": {\"type\":","\"\"","","","","","","} } ] }","",""]
[null,null,null,null,null,null,null,null,null,"{","",", \"actions\": [{\"trigger\": {\"type\": \"timestamp\", \"data\": \"",0,"\"}, \"event\": {\"type\":","\"\"","","","","","","} } ] }","",""]
[null,null,null,null,null,null,null,null,null,"{","",", \"actions\": [{\"trigger\": {\"type\": \"timestamp\", \"data\": \"",0,"\"}, \"event\": {\"type\":","\"\"","","","","","","} } ] }","",""]
[null,null,null,null,null,null,null,null,null,"{","",", \"actions\": [{\"trigger\": {\"type\": \"timestamp\", \"data\": \"",0,"\"}, \"event\": {\"type\":","\"\"","","","","","","} } ] }","",""]
[null,null,null,null,null,null,null,null,null,"{","",", \"actions\": [{\"trigger\": {\"type\": \"timestamp\", \"data\": \"",0,"\"}, \"event\": {\"type\":","\"\"","","","","","","} } ] }","",""]
[null,null,null,null,null,null,null,null,null,"{","",", \"actions\": [{\"trigger\": {\"type\": \"timestamp\", \"data\": \"",0,"\"}, \"event\": {\"type\":","\"\"","","","","","","} } ] }","",""]
[null,null,null,null,null,null,null,null,null,"{","",", \"actions\": [{\"trigger\": {\"type\": \"timestamp\", \"data\": \"",0,"\"}, \"event\": {\"type\":","\"\"","","","","","","} } ] }","",""]
[null,null,null,null,null,null,null,null,null,"{","",", \"actions\": [{\"trigger\": {\"type\": \"timestamp\", \"data\": \"",0,"\"}, \"event\": {\"type\":","\"\"","","","","","","} } ] }","",""]
[null,null,null,null,null,null,null,null,null,"{","",", \"actions\": [{\"trigger\": {\"type\": \"timestamp\", \"data\": \"",0,"\"}, \"event\": {\"type\":","\"\"","","","","","","} } ] }","",""]
[null,null,null,null,null,null,null,null,null,"{","",", \"actions\": [{\"trigger\": {\"type\": \"timestamp\", \"data\": \"",0,"\"}, \"event\": {\"type\":","\"\"","","","","","","} } ] }","",""]
[null,null,null,null,null,null,null,null,null,"{","",", \"actions\": [{\"trigger\": {\"type\": \"timestamp\", \"data\": \"",0,"\"}, \"event\": {\"type\":","\"\"","","","","","","} } ] }","",""]
[null,null,null,null,null,null,null,null,null,"{","",", \"actions\": [{\"trigger\": {\"type\": \"timestamp\", \"data\": \"",0,"\"}, \"event\": {\"type\":","\"\"","","","","","","} } ] }","",""]
[null,null,null,null,null,null,null,null,null,"{","",", \"actions\": [{\"trigger\": {\"type\": \"timestamp\", \"data\": \"",0,"\"}, \"event\": {\"type\":","\"\"","","","","","","} } ] }","",""]
[null,null,null,null,null,null,null,null,null,"{","",", \"actions\": [{\"trigger\": {\"type\": \"timestamp\", \"data\": \"",0,"\"}, \"event\": {\"type\":","\"\"","","","","","","} } ] }","",""]
[null,null,null,null,null,null,null,null,null,"{","",", \"actions\": [{\"trigger\": {\"type\": \"timestamp\", \"data\": \"",0,"\"}, \"event\": {\"type\":","\"\"","","","","","","} } ] }","",""]
[null,null,null,null,null,null,null,null,null,"{","",", \"actions\": [{\"trigger\": {\"type\": \"timestamp\", \"data\": \"",0,"\"}, \"event\": {\"type\":","\"\"","","","","","","} } ] }","",""]
[null,null,null,null,null,null,null,null,null,"{","",", \"actions\": [{\"trigger\": {\"type\": \"timestamp\", \"data\": \"",0,"\"}, \"event\": {\"type\":","\"\"","","","","","","} } ] }","",""]
[null,null,null,null,null,null,null,null,null,"{","",", \"actions\": [{\"trigger\": {\"type\": \"timestamp\", \"data\": \"",0,"\"}, \"event\": {\"type\":","\"\"","","","","","","} } ] }","",""]
[null,null,null,null,null,null,null,null,null,"{","",", \"actions\": [{\"trigger\": {\"type\": \"timestamp\", \"data\": \"",0,"\"}, \"event\": {\"type\":","\"\"","","","","","","} } ] }","",""]
[null,null,null,null,null,null,null,null,null,"{","",", \"actions\": [{\"trigger\": {\"type\": \"timestamp\", \"data\": \"",0,"\"}, \"event\": {\"type\":","\"\"","","","","","","} } ] }","",""]
[null,null,null,null,null,null,null,null,null,"{","",", \"actions\": [{\"trigger\": {\"type\": \"timestamp\", \"data\": \"",0,"\"}, \"event\": {\"type\":","\"\"","","","","","","} } ] }","",""]
[null,null,null,null,null,null,null,null,null,"{","",", \"actions\": [{\"trigger\": {\"type\": \"timestamp\", \"data\": \"",0,"\"}, \"event\": {\"type\":","\"\"","","","","","","} } ] }","",""]
[null,null,null,null,null,null,null,null,null,"{","",", \"actions\": [{\"trigger\": {\"type\": \"timestamp\", \"data\": \"",0,"\"}, \"event\": {\"type\":","\"\"","","","","","","} } ] }","",""]
[null,null,null,null,null,null,null,null,null,"{","",", \"actions\": [{\"trigger\": {\"type\": \"timestamp\", \"data\": \"",0,"\"}, \"event\": {\"type\":","\"\"","","","","","","} } ] }","",""]
[null,null,null,null,null,null,null,null,null,"{","",", \"actions\": [{\"trigger\": {\"type\": \"timestamp\", \"data\": \"",0,"\"}, \"event\": {\"type\":","\"\"","","","","","","} } ] }","",""]
[null,null,null,null,null,null,null,null,null,"{","",", \"actions\": [{\"trigger\": {\"type\": \"timestamp\", \"data\": \"",0,"\"}, \"event\": {\"type\":","\"\"","","","","","","} } ] }","",""]
[null,null,null,null,null,null,null,null,null,"{","",", \"actions\": [{\"trigger\": {\"type\": \"timestamp\", \"data\": \"",0,"\"}, \"event\": {\"type\":","\"\"","","","","","","} } ] }","",""]
[null,null,null,null,null,null,null,null,null,"{","",", \"actions\": [{\"trigger\": {\"type\": \"timestamp\", \"data\": \"",0,"\"}, \"event\": {\"type\":","\"\"","","","","","","} } ] }","",""]
[null,null,null,null,null,null,null,null,null,"{","",", \"actions\": [{\"trigger\": {\"type\": \"timestamp\", \"data\": \"",0,"\"}, \"event\": {\"type\":","\"\"","","","","","","} } ] }","",""]
[null,null,null,null,null,null,null,null,null,"{","",", \"actions\": [{\"trigger\": {\"type\": \"timestamp\", \"data\": \"",0,"\"}, \"event\": {\"type\":","\"\"","","","","","","} } ] }","",""]
[null,null,null,null,null,null,null,null,null,"{","",", \"actions\": [{\"trigger\": {\"type\": \"timestamp\", \"data\": \"",0,"\"}, \"event\": {\"type\":","\"\"","","","","","","} } ] }","",""]
[null,null,null,null,null,null,null,null,null,"{","",", \"actions\": [{\"trigger\": {\"type\": \"timestamp\", \"data\": \"",0,"\"}, \"event\": {\"type\":","\"\"","","","","","","} } ] }","",""]
[null,null,null,null,null,null,null,null,null,"{","",", \"actions\": [{\"trigger\": {\"type\": \"timestamp\", \"data\": \"",0,"\"}, \"event\": {\"type\":","\"\"","","","","","","} } ] }","",""]
[null,null,null,null,null,null,null,null,null,"{","",", \"actions\": [{\"trigger\": {\"type\": \"timestamp\", \"data\": \"",0,"\"}, \"event\": {\"type\":","\"\"","","","","","","} } ] }","",""]
[null,null,null,null,null,null,null,null,null,"{","",", \"actions\": [{\"trigger\": {\"type\": \"timestamp\", \"data\": \"",0,"\"}, \"event\": {\"type\":","\"\"","","","","","","} } ] }","",""]
[null,null,null,null,null,null,null,null,null,"{","",", \"actions\": [{\"trigger\": {\"type\": \"timestamp\", \"data\": \"",0,"\"}, \"event\": {\"type\":","\"\"","","","","","","} } ] }","",""]
[null,null,null,null,null,null,null,null,null,"{","",", \"actions\": [{\"trigger\": {\"type\": \"timestamp\", \"data\": \"",0,"\"}, \"event\": {\"type\":","\"\"","","","","","","} } ] }","",""]
[null,null,null,null,null,null,null,null,null,"{","",", \"actions\": [{\"trigger\": {\"type\": \"timestamp\", \"data\": \"",0,"\"}, \"event\": {\"type\":","\"\"","","","","","","} } ] }","",""]
[null,null,null,null,null,null,null,null,null,"{","",", \"actions\": [{\"trigger\": {\"type\": \"timestamp\", \"data\": \"",0,"\"}, \"event\": {\"type\":","\"\"","","","","","","} } ] }","",""]
[null,null,null,null,null,null,null,null,null,"{","",", \"actions\": [{\"trigger\": {\"type\": \"timestamp\", \"data\": \"",0,"\"}, \"event\": {\"type\":","\"\"","","","","","","} } ] }","",""]
[null,null,null,null,null,null,null,null,null,"{","",", \"actions\": [{\"trigger\": {\"type\": \"timestamp\", \"data\": \"",0,"\"}, \"event\": {\"type\":","\"\"","","","","","","} } ] }","",""]
[null,null,null,null,null,null,null,null,null,"{","",", \"actions\": [{\"trigger\": {\"type\": \"timestamp\", \"data\": \"",0,"\"}, \"event\": {\"type\":","\"\"","","","","","","} } ] }","",""]
[null,null,null,null,null,null,null,null,null,"{","",", \"actions\": [{\"trigger\": {\"type\": \"timestamp\", \"data\": \"",0,"\"}, \"event\": {\"type\":","\"\"","","","","","","} } ] }","",""]
[null,null,null,null,null,null,null,null,null,"{","",", \"actions\": [{\"trigger\": {\"type\": \"timestamp\", \"data\": \"",0,"\"}, \"event\": {\"type\":","\"\"","","","","","","} } ] }","",""]
[null,null,null,null,null,null,null,null,null,"{","",", \"actions\": [{\"trigger\": {\"type\": \"timestamp\", \"data\": \"",0,"\"}, \"event\": {\"type\":","\"\"","","","","","","} } ] }","",""]
[null,null,null,null,null,null,null,null,null,"{","",", \"actions\": [{\"trigger\": {\"type\": \"timestamp\", \"data\": \"",0,"\"}, \"event\": {\"type\":","\"\"","","","","","","} } ] }","",""]
[null,null,null,null,null,null,null,null,null,"{","",", \"actions\": [{\"trigger\": {\"type\": \"timestamp\", \"data\": \"",0,"\"}, \"event\": {\"type\":","\"\"","","","","","","} } ] }","",""]
[null,null,null,null,null,null,null,null,null,"{",{"$f":"IF(A335<>\"\",CONCATENATE(\"\"\"\",A$3,\"\"\": \"\"\",$B$1,A335,\"\"\"\"),\"\")","v":""},", \"actions\": [{\"trigger\": {\"type\": \"timestamp\", \"data\": \"",{"$f":"B335*1000","v":0},"\"}, \"event\": {\"type\":",{"$f":"CONCATENATE(\"\"\"\",C335,\"\"\"\")","v":"\"\""},{"$f":"IF(D335<>\"\",CONCATENATE(\",\"\"\",D$3,\"\"\": \"\"\",D335,\"\"\"\"),\"\")","v":""},{"$f":"IF(E335<>\"\",CONCATENATE(\",\"\"\",E$3,\"\"\": \"\"\",E335,\"\"\"\"),\"\")","v":""},{"$f":"IF(F335<>\"\",CONCATENATE(\",\"\"\",F$3,\"\"\": \",F335),\"\")","v":""},{"$f":"IF(G335<>\"\",CONCATENATE(\",\"\"\",G$3,\"\"\": \",G335),\"\")","v":""},{"$f":"IF(H335<>\"\",CONCATENATE(\",\"\"\",H$3,\"\"\": \"\"\",H335,\"\"\"\"),\"\")","v":""},"} } ] }",{"$f":"IF(A335<>\"\",CONCATENATE(J335,K335,L335,M335,N335,O335,P335,Q335,R335,S335,T335,U335),\"\")","v":""},{"$f":"CONCATENATE(IF(AND(W334<>\"\",X334=\"\"),CONCATENATE(W334,IF(A335<>\"\",\",\",\"\")),\"\"),V335)","v":""}]
[null,null,null,null,null,null,null,null,null,"{","",", \"actions\": [{\"trigger\": {\"type\": \"timestamp\", \"data\": \"",0,"\"}, \"event\": {\"type\":","\"\"","","","","","","} } ] }","",""]
[null,null,null,null,null,null,null,null,null,"{","",", \"actions\": [{\"trigger\": {\"type\": \"timestamp\", \"data\": \"",0,"\"}, \"event\": {\"type\":","\"\"","","","","","","} } ] }","",""]
[null,null,null,null,null,null,null,null,null,"{","",", \"actions\": [{\"trigger\": {\"type\": \"timestamp\", \"data\": \"",0,"\"}, \"event\": {\"type\":","\"\"","","","","","","} } ] }","",""]
[null,null,null,null,null,null,null,null,null,"{","",", \"actions\": [{\"trigger\": {\"type\": \"timestamp\", \"data\": \"",0,"\"}, \"event\": {\"type\":","\"\"","","","","","","} } ] }","",""]
[null,null,null,null,null,null,null,null,null,"{","",", \"actions\": [{\"trigger\": {\"type\": \"timestamp\", \"data\": \"",0,"\"}, \"event\": {\"type\":","\"\"","","","","","","} } ] }","",""]
[null,null,null,null,null,null,null,null,null,"{","",", \"actions\": [{\"trigger\": {\"type\": \"timestamp\", \"data\": \"",0,"\"}, \"event\": {\"type\":","\"\"","","","","","","} } ] }","",""]
[null,null,null,null,null,null,null,null,null,"{","",", \"actions\": [{\"trigger\": {\"type\": \"timestamp\", \"data\": \"",0,"\"}, \"event\": {\"type\":","\"\"","","","","","","} } ] }","",""]
[null,null,null,null,null,null,null,null,null,"{","",", \"actions\": [{\"trigger\": {\"type\": \"timestamp\", \"data\": \"",0,"\"}, \"event\": {\"type\":","\"\"","","","","","","} } ] }","",""]
[null,null,null,null,null,null,null,null,null,"{","",", \"actions\": [{\"trigger\": {\"type\": \"timestamp\", \"data\": \"",0,"\"}, \"event\": {\"type\":","\"\"","","","","","","} } ] }","",""]
[null,null,null,null,null,null,null,null,null,"{","",", \"actions\": [{\"trigger\": {\"type\": \"timestamp\", \"data\": \"",0,"\"}, \"event\": {\"type\":","\"\"","","","","","","} } ] }","",""]
[null,null,null,null,null,null,null,null,null,"{","",", \"actions\": [{\"trigger\": {\"type\": \"timestamp\", \"data\": \"",0,"\"}, \"event\": {\"type\":","\"\"","","","","","","} } ] }","",""]
[null,null,null,null,null,null,null,null,null,"{","",", \"actions\": [{\"trigger\": {\"type\": \"timestamp\", \"data\": \"",0,"\"}, \"event\": {\"type\":","\"\"","","","","","","} } ] }","",""]
[null,null,null,null,null,null,null,null,null,"{","",", \"actions\": [{\"trigger\": {\"type\": \"timestamp\", \"data\": \"",0,"\"}, \"event\": {\"type\":","\"\"","","","","","","} } ] }","",""]
[null,null,null,null,null,null,null,null,null,"{","",", \"actions\": [{\"trigger\": {\"type\": \"timestamp\", \"data\": \"",0,"\"}, \"event\": {\"type\":","\"\"","","","","","","} } ] }","",""]
[null,null,null,null,null,null,null,null,null,"{","",", \"actions\": [{\"trigger\": {\"type\": \"timestamp\", \"data\": \"",0,"\"}, \"event\": {\"type\":","\"\"","","","","","","} } ] }","",""]
[null,null,null,null,null,null,null,null,null,"{","",", \"actions\": [{\"trigger\": {\"type\": \"timestamp\", \"data\": \"",0,"\"}, \"event\": {\"type\":","\"\"","","","","","","} } ] }","",""]
[null,null,null,null,null,null,null,null,null,"{","",", \"actions\": [{\"trigger\": {\"type\": \"timestamp\", \"data\": \"",0,"\"}, \"event\": {\"type\":","\"\"","","","","","","} } ] }","",""]
[null,null,null,null,null,null,null,null,null,"{","",", \"actions\": [{\"trigger\": {\"type\": \"timestamp\", \"data\": \"",0,"\"}, \"event\": {\"type\":","\"\"","","","","","","} } ] }","",""]
[null,null,null,null,null,null,null,null,null,"{","",", \"actions\": [{\"trigger\": {\"type\": \"timestamp\", \"data\": \"",0,"\"}, \"event\": {\"type\":","\"\"","","","","","","} } ] }","",""]
[null,null,null,null,null,null,null,null,null,"{","",", \"actions\": [{\"trigger\": {\"type\": \"timestamp\", \"data\": \"",0,"\"}, \"event\": {\"type\":","\"\"","","","","","","} } ] }","",""]
[null,null,null,null,null,null,null,null,null,"{","",", \"actions\": [{\"trigger\": {\"type\": \"timestamp\", \"data\": \"",0,"\"}, \"event\": {\"type\":","\"\"","","","","","","} } ] }","",""]
[null,null,null,null,null,null,null,null,null,"{","",", \"actions\": [{\"trigger\": {\"type\": \"timestamp\", \"data\": \"",0,"\"}, \"event\": {\"type\":","\"\"","","","","","","} } ] }","",""]
[null,null,null,null,null,null,null,null,null,"{","",", \"actions\": [{\"trigger\": {\"type\": \"timestamp\", \"data\": \"",0,"\"}, \"event\": {\"type\":","\"\"","","","","","","} } ] }","",""]
[null,null,null,null,null,null,null,null,null,"{","",", \"actions\": [{\"trigger\": {\"type\": \"timestamp\", \"data\": \"",0,"\"}, \"event\": {\"type\":","\"\"","","","","","","} } ] }","",""]
[null,null,null,null,null,null,null,null,null,"{","",", \"actions\": [{\"trigger\": {\"type\": \"timestamp\", \"data\": \"",0,"\"}, \"event\": {\"type\":","\"\"","","","","","","} } ] }","",""]
[null,null,null,null,null,null,null,null,null,"{","",", \"actions\": [{\"trigger\": {\"type\": \"timestamp\", \"data\": \"",0,"\"}, \"event\": {\"type\":","\"\"","","","","","","} } ] }","",""]
[null,null,null,null,null,null,null,null,null,"{","",", \"actions\": [{\"trigger\": {\"type\": \"timestamp\", \"data\": \"",0,"\"}, \"event\": {\"type\":","\"\"","","","","","","} } ] }","",""]
[null,null,null,null,null,null,null,null,null,"{","",", \"actions\": [{\"trigger\": {\"type\": \"timestamp\", \"data\": \"",0,"\"}, \"event\": {\"type\":","\"\"","","","","","","} } ] }","",""]
[null,null,null,null,null,null,null,null,null,"{","",", \"actions\": [{\"trigger\": {\"type\": \"timestamp\", \"data\": \"",0,"\"}, \"event\": {\"type\":","\"\"","","","","","","} } ] }","",""]
[null,null,null,null,null,null,null,null,null,"{","",", \"actions\": [{\"trigger\": {\"type\": \"timestamp\", \"data\": \"",0,"\"}, \"event\": {\"type\":","\"\"","","","","","","} } ] }","",""]
[null,null,null,null,null,null,null,null,null,"{","",", \"actions\": [{\"trigger\": {\"type\": \"timestamp\", \"data\": \"",0,"\"}, \"event\": {\"type\":","\"\"","","","","","","} } ] }","",""]
[null,null,null,null,null,null,null,null,null,"{","",", \"actions\": [{\"trigger\": {\"type\": \"timestamp\", \"data\": \"",0,"\"}, \"event\": {\"type\":","\"\"","","","","","","} } ] }","",""]
[null,null,null,null,null,null,null,null,null,"{","",", \"actions\": [{\"trigger\": {\"type\": \"timestamp\", \"data\": \"",0,"\"}, \"event\": {\"type\":","\"\"","","","","","","} } ] }","","",2]
[null,null,null,null,null,null,null,null,null,"{","",", \"actions\": [{\"trigger\": {\"type\": \"timestamp\", \"data\": \"",0,"\"}, \"event\": {\"type\":","\"\"","","","","","","} } ] }","",""]
[null,null,null,null,null,null,null,null,null,"{","",", \"actions\": [{\"trigger\": {\"type\": \"timestamp\", \"data\": \"",0,"\"}, \"event\": {\"type\":","\"\"","","","","","","} } ] }","",""]
[null,null,null,null,null,null,null,null,null,"{","",", \"actions\": [{\"trigger\": {\"type\": \"timestamp\", \"data\": \"",0,"\"}, \"event\": {\"type\":","\"\"","","","","","","} } ] }","",""]
[null,null,null,null,null,null,null,null,null,"{","",", \"actions\": [{\"trigger\": {\"type\": \"timestamp\", \"data\": \"",0,"\"}, \"event\": {\"type\":","\"\"","","","","","","} } ] }","",""]
[null,null,null,null,null,null,null,null,null,"{","",", \"actions\": [{\"trigger\": {\"type\": \"timestamp\", \"data\": \"",0,"\"}, \"event\": {\"type\":","\"\"","","","","","","} } ] }","",""]
[null,null,null,null,null,null,null,null,null,"{","",", \"actions\": [{\"trigger\": {\"type\": \"timestamp\", \"data\": \"",0,"\"}, \"event\": {\"type\":","\"\"","","","","","","} } ] }","",""]
[null,null,null,null,null,null,null,null,null,"{","",", \"actions\": [{\"trigger\": {\"type\": \"timestamp\", \"data\": \"",0,"\"}, \"event\": {\"type\":","\"\"","","","","","","} } ] }","",""]
[null,null,null,null,null,null,null,null,null,"{","",", \"actions\": [{\"trigger\": {\"type\": \"timestamp\", \"data\": \"",0,"\"}, \"event\": {\"type\":","\"\"","","","","","","} } ] }","",""]
[null,null,null,null,null,null,null,null,null,"{","",", \"actions\": [{\"trigger\": {\"type\": \"timestamp\", \"data\": \"",0,"\"}, \"event\": {\"type\":","\"\"","","","","","","} } ] }","",""]
[null,null,null,null,null,null,null,null,null,"{","",", \"actions\": [{\"trigger\": {\"type\": \"timestamp\", \"data\": \"",0,"\"}, \"event\": {\"type\":","\"\"","","","","","","} } ] }","",""]
[null,null,null,null,null,null,null,null,null,"{","",", \"actions\": [{\"trigger\": {\"type\": \"timestamp\", \"data\": \"",0,"\"}, \"event\": {\"type\":","\"\"","","","","","","} } ] }","",""]
[null,null,null,null,null,null,null,null,null,"{","",", \"actions\": [{\"trigger\": {\"type\": \"timestamp\", \"data\": \"",0,"\"}, \"event\": {\"type\":","\"\"","","","","","","} } ] }","",""]
[null,null,null,null,null,null,null,null,null,"{","",", \"actions\": [{\"trigger\": {\"type\": \"timestamp\", \"data\": \"",0,"\"}, \"event\": {\"type\":","\"\"","","","","","","} } ] }","",""]
[null,null,null,null,null,null,null,null,null,"{","",", \"actions\": [{\"trigger\": {\"type\": \"timestamp\", \"data\": \"",0,"\"}, \"event\": {\"type\":","\"\"","","","","","","} } ] }","",""]
[null,null,null,null,null,null,null,null,null,"{","",", \"actions\": [{\"trigger\": {\"type\": \"timestamp\", \"data\": \"",0,"\"}, \"event\": {\"type\":","\"\"","","","","","","} } ] }","",""]
[null,null,null,null,null,null,null,null,null,"{","",", \"actions\": [{\"trigger\": {\"type\": \"timestamp\", \"data\": \"",0,"\"}, \"event\": {\"type\":","\"\"","","","","","","} } ] }","",""]
[null,null,null,null,null,null,null,null,null,"{","",", \"actions\": [{\"trigger\": {\"type\": \"timestamp\", \"data\": \"",0,"\"}, \"event\": {\"type\":","\"\"","","","","","","} } ] }","",""]
[null,null,null,null,null,null,null,null,null,"{","",", \"actions\": [{\"trigger\": {\"type\": \"timestamp\", \"data\": \"",0,"\"}, \"event\": {\"type\":","\"\"","","","","","","} } ] }","",""]
[null,null,null,null,null,null,null,null,null,"{","",", \"actions\": [{\"trigger\": {\"type\": \"timestamp\", \"data\": \"",0,"\"}, \"event\": {\"type\":","\"\"","","","","","","} } ] }","",""]
[null,null,null,null,null,null,null,null,null,"{","",", \"actions\": [{\"trigger\": {\"type\": \"timestamp\", \"data\": \"",0,"\"}, \"event\": {\"type\":","\"\"","","","","","","} } ] }","",""]
[null,null,null,null,null,null,null,null,null,"{","",", \"actions\": [{\"trigger\": {\"type\": \"timestamp\", \"data\": \"",0,"\"}, \"event\": {\"type\":","\"\"","","","","","","} } ] }","",""]
[null,null,null,null,null,null,null,null,null,"{","",", \"actions\": [{\"trigger\": {\"type\": \"timestamp\", \"data\": \"",0,"\"}, \"event\": {\"type\":","\"\"","","","","","","} } ] }","",""]
[null,null,null,null,null,null,null,null,null,"{","",", \"actions\": [{\"trigger\": {\"type\": \"timestamp\", \"data\": \"",0,"\"}, \"event\": {\"type\":","\"\"","","","","","","} } ] }","",""]
[null,null,null,null,null,null,null,null,null,"{","",", \"actions\": [{\"trigger\": {\"type\": \"timestamp\", \"data\": \"",0,"\"}, \"event\": {\"type\":","\"\"","","","","","","} } ] }","",""]
[null,null,null,null,null,null,null,null,null,"{","",", \"actions\": [{\"trigger\": {\"type\": \"timestamp\", \"data\": \"",0,"\"}, \"event\": {\"type\":","\"\"","","","","","","} } ] }","",""]
[null,null,null,null,null,null,null,null,null,"{","",", \"actions\": [{\"trigger\": {\"type\": \"timestamp\", \"data\": \"",0,"\"}, \"event\": {\"type\":","\"\"","","","","","","} } ] }","",""]
[null,null,null,null,null,null,null,null,null,"{","",", \"actions\": [{\"trigger\": {\"type\": \"timestamp\", \"data\": \"",0,"\"}, \"event\": {\"type\":","\"\"","","","","","","} } ] }","",""]
[null,null,null,null,null,null,null,null,null,"{","",", \"actions\": [{\"trigger\": {\"type\": \"timestamp\", \"data\": \"",0,"\"}, \"event\": {\"type\":","\"\"","","","","","","} } ] }","",""]
[null,null,null,null,null,null,null,null,null,"{","",", \"actions\": [{\"trigger\": {\"type\": \"timestamp\", \"data\": \"",0,"\"}, \"event\": {\"type\":","\"\"","","","","","","} } ] }","",""]
[null,null,null,null,null,null,null,null,null,"{","",", \"actions\": [{\"trigger\": {\"type\": \"timestamp\", \"data\": \"",0,"\"}, \"event\": {\"type\":","\"\"","","","","","","} } ] }","",""]
[null,null,null,null,null,null,null,null,null,"{",{"$f":"IF(A399<>\"\",CONCATENATE(\"\"\"\",A$3,\"\"\": \"\"\",$B$1,A399,\"\"\"\"),\"\")","v":""},", \"actions\": [{\"trigger\": {\"type\": \"timestamp\", \"data\": \"",{"$f":"B399*1000","v":0},"\"}, \"event\": {\"type\":",{"$f":"CONCATENATE(\"\"\"\",C399,\"\"\"\")","v":"\"\""},{"$f":"IF(D399<>\"\",CONCATENATE(\",\"\"\",D$3,\"\"\": \"\"\",D399,\"\"\"\"),\"\")","v":""},{"$f":"IF(E399<>\"\",CONCATENATE(\",\"\"\",E$3,\"\"\": \"\"\",E399,\"\"\"\"),\"\")","v":""},{"$f":"IF(F399<>\"\",CONCATENATE(\",\"\"\",F$3,\"\"\": \",F399),\"\")","v":""},{"$f":"IF(G399<>\"\",CONCATENATE(\",\"\"\",G$3,\"\"\": \",G399),\"\")","v":""},{"$f":"IF(H399<>\"\",CONCATENATE(\",\"\"\",H$3,\"\"\": \"\"\",H399,\"\"\"\"),\"\")","v":""},"} } ] }",{"$f":"IF(A399<>\"\",CONCATENATE(J399,K399,L399,M399,N399,O399,P399,Q399,R399,S399,T399,U399),\"\")","v":""},{"$f":"CONCATENATE(IF(AND(W398<>\"\",X398=\"\"),CONCATENATE(W398,IF(A399<>\"\",\",\",\"\")),\"\"),V399)","v":""}]
[null,null,null,null,null,null,null,null,null,"{","",", \"actions\": [{\"trigger\": {\"type\": \"timestamp\", \"data\": \"",0,"\"}, \"event\": {\"type\":","\"\"","","","","","","} } ] }","",""]
[null,null,null,null,null,null,null,null,null,"{","",", \"actions\": [{\"trigger\": {\"type\": \"timestamp\", \"data\": \"",0,"\"}, \"event\": {\"type\":","\"\"","","","","","","} } ] }","",""]
[null,null,null,null,null,null,null,null,null,"{","",", \"actions\": [{\"trigger\": {\"type\": \"timestamp\", \"data\": \"",0,"\"}, \"event\": {\"type\":","\"\"","","","","","","} } ] }","",""]
[null,null,null,null,null,null,null,null,null,"{","",", \"actions\": [{\"trigger\": {\"type\": \"timestamp\", \"data\": \"",0,"\"}, \"event\": {\"type\":","\"\"","","","","","","} } ] }","",""]
[null,null,null,null,null,null,null,null,null,"{","",", \"actions\": [{\"trigger\": {\"type\": \"timestamp\", \"data\": \"",0,"\"}, \"event\": {\"type\":","\"\"","","","","","","} } ] }","",""]
[null,null,null,null,null,null,null,null,null,"{","",", \"actions\": [{\"trigger\": {\"type\": \"timestamp\", \"data\": \"",0,"\"}, \"event\": {\"type\":","\"\"","","","","","","} } ] }","",""]
[null,null,null,null,null,null,null,null,null,"{","",", \"actions\": [{\"trigger\": {\"type\": \"timestamp\", \"data\": \"",0,"\"}, \"event\": {\"type\":","\"\"","","","","","","} } ] }","",""]
[null,null,null,null,null,null,null,null,null,"{","",", \"actions\": [{\"trigger\": {\"type\": \"timestamp\", \"data\": \"",0,"\"}, \"event\": {\"type\":","\"\"","","","","","","} } ] }","",""]
[null,null,null,null,null,null,null,null,null,"{","",", \"actions\": [{\"trigger\": {\"type\": \"timestamp\", \"data\": \"",0,"\"}, \"event\": {\"type\":","\"\"","","","","","","} } ] }","",""]
[null,null,null,null,null,null,null,null,null,"{","",", \"actions\": [{\"trigger\": {\"type\": \"timestamp\", \"data\": \"",0,"\"}, \"event\": {\"type\":","\"\"","","","","","","} } ] }","",""]
[null,null,null,null,null,null,null,null,null,"{","",", \"actions\": [{\"trigger\": {\"type\": \"timestamp\", \"data\": \"",0,"\"}, \"event\": {\"type\":","\"\"","","","","","","} } ] }","",""]
[null,null,null,null,null,null,null,null,null,"{","",", \"actions\": [{\"trigger\": {\"type\": \"timestamp\", \"data\": \"",0,"\"}, \"event\": {\"type\":","\"\"","","","","","","} } ] }","",""]
[null,null,null,null,null,null,null,null,null,"{","",", \"actions\": [{\"trigger\": {\"type\": \"timestamp\", \"data\": \"",0,"\"}, \"event\": {\"type\":","\"\"","","","","","","} } ] }","",""]
[null,null,null,null,null,null,null,null,null,"{","",", \"actions\": [{\"trigger\": {\"type\": \"timestamp\", \"data\": \"",0,"\"}, \"event\": {\"type\":","\"\"","","","","","","} } ] }","",""]
[null,null,null,null,null,null,null,null,null,"{","",", \"actions\": [{\"trigger\": {\"type\": \"timestamp\", \"data\": \"",0,"\"}, \"event\": {\"type\":","\"\"","","","","","","} } ] }","",""]
[null,null,null,null,null,null,null,null,null,"{","",", \"actions\": [{\"trigger\": {\"type\": \"timestamp\", \"data\": \"",0,"\"}, \"event\": {\"type\":","\"\"","","","","","","} } ] }","",""]
[null,null,null,null,null,null,null,null,null,"{","",", \"actions\": [{\"trigger\": {\"type\": \"timestamp\", \"data\": \"",0,"\"}, \"event\": {\"type\":","\"\"","","","","","","} } ] }","",""]
[null,null,null,null,null,null,null,null,null,"{","",", \"actions\": [{\"trigger\": {\"type\": \"timestamp\", \"data\": \"",0,"\"}, \"event\": {\"type\":","\"\"","","","","","","} } ] }","",""]
[null,null,null,null,null,null,null,null,null,"{","",", \"actions\": [{\"trigger\": {\"type\": \"timestamp\", \"data\": \"",0,"\"}, \"event\": {\"type\":","\"\"","","","","","","} } ] }","",""]
[null,null,null,null,null,null,null,null,null,"{","",", \"actions\": [{\"trigger\": {\"type\": \"timestamp\", \"data\": \"",0,"\"}, \"event\": {\"type\":","\"\"","","","","","","} } ] }","",""]
[null,null,null,null,null,null,null,null,null,"{","",", \"actions\": [{\"trigger\": {\"type\": \"timestamp\", \"data\": \"",0,"\"}, \"event\": {\"type\":","\"\"","","","","","","} } ] }","",""]
[null,null,null,null,null,null,null,null,null,"{","",", \"actions\": [{\"trigger\": {\"type\": \"timestamp\", \"data\": \"",0,"\"}, \"event\": {\"type\":","\"\"","","","","","","} } ] }","",""]
[null,null,null,null,null,null,null,null,null,"{","",", \"actions\": [{\"trigger\": {\"type\": \"timestamp\", \"data\": \"",0,"\"}, \"event\": {\"type\":","\"\"","","","","","","} } ] }","",""]
[null,null,null,null,null,null,null,null,null,"{","",", \"actions\": [{\"trigger\": {\"type\": \"timestamp\", \"data\": \"",0,"\"}, \"event\": {\"type\":","\"\"","","","","","","} } ] }","",""]
[null,null,null,null,null,null,null,null,null,"{","",", \"actions\": [{\"trigger\": {\"type\": \"timestamp\", \"data\": \"",0,"\"}, \"event\": {\"type\":","\"\"","","","","","","} } ] }","",""]
[null,null,null,null,null,null,null,null,null,"{","",", \"actions\": [{\"trigger\": {\"type\": \"timestamp\", \"data\": \"",0,"\"}, \"event\": {\"type\":","\"\"","","","","","","} } ] }","",""]
[null,null,null,null,null,null,null,null,null,"{","",", \"actions\": [{\"trigger\": {\"type\": \"timestamp\", \"data\": \"",0,"\"}, \"event\": {\"type\":","\"\"","","","","","","} } ] }","",""]
[null,null,null,null,null,null,null,null,null,"{","",", \"actions\": [{\"trigger\": {\"type\": \"timestamp\", \"data\": \"",0,"\"}, \"event\": {\"type\":","\"\"","","","","","","} } ] }","",""]
[null,null,null,null,null,null,null,null,null,"{","",", \"actions\": [{\"trigger\": {\"type\": \"timestamp\", \"data\": \"",0,"\"}, \"event\": {\"type\":","\"\"","","","","","","} } ] }","",""]
[null,null,null,null,null,null,null,null,null,"{","",", \"actions\": [{\"trigger\": {\"type\": \"timestamp\", \"data\": \"",0,"\"}, \"event\": {\"type\":","\"\"","","","","","","} } ] }","",""]
[null,null,null,null,null,null,null,null,null,"{","",", \"actions\": [{\"trigger\": {\"type\": \"timestamp\", \"data\": \"",0,"\"}, \"event\": {\"type\":","\"\"","","","","","","} } ] }","",""]
[null,null,null,null,null,null,null,null,null,"{","",", \"actions\": [{\"trigger\": {\"type\": \"timestamp\", \"data\": \"",0,"\"}, \"event\": {\"type\":","\"\"","","","","","","} } ] }","",""]
[null,null,null,null,null,null,null,null,null,"{","",", \"actions\": [{\"trigger\": {\"type\": \"timestamp\", \"data\": \"",0,"\"}, \"event\": {\"type\":","\"\"","","","","","","} } ] }","",""]
[null,null,null,null,null,null,null,null,null,"{","",", \"actions\": [{\"trigger\": {\"type\": \"timestamp\", \"data\": \"",0,"\"}, \"event\": {\"type\":","\"\"","","","","","","} } ] }","",""]
[null,null,null,null,null,null,null,null,null,"{","",", \"actions\": [{\"trigger\": {\"type\": \"timestamp\", \"data\": \"",0,"\"}, \"event\": {\"type\":","\"\"","","","","","","} } ] }","",""]
[null,null,null,null,null,null,null,null,null,"{","",", \"actions\": [{\"trigger\": {\"type\": \"timestamp\", \"data\": \"",0,"\"}, \"event\": {\"type\":","\"\"","","","","","","} } ] }","",""]
[null,null,null,null,null,null,null,null,null,"{","",", \"actions\": [{\"trigger\": {\"type\": \"timestamp\", \"data\": \"",0,"\"}, \"event\": {\"type\":","\"\"","","","","","","} } ] }","",""]
[null,null,null,null,null,null,null,null,null,"{","",", \"actions\": [{\"trigger\": {\"type\": \"timestamp\", \"data\": \"",0,"\"}, \"event\": {\"type\":","\"\"","","","","","","} } ] }","",""]
[null,null,null,null,null,null,null,null,null,"{","",", \"actions\": [{\"trigger\": {\"type\": \"timestamp\", \"data\": \"",0,"\"}, \"event\": {\"type\":","\"\"","","","","","","} } ] }","",""]
[null,null,null,null,null,null,null,null,null,"{","",", \"actions\": [{\"trigger\": {\"type\": \"timestamp\", \"data\": \"",0,"\"}, \"event\": {\"type\":","\"\"","","","","","","} } ] }","",""]
[null,null,null,null,null,null,null,null,null,"{","",", \"actions\": [{\"trigger\": {\"type\": \"timestamp\", \"data\": \"",0,"\"}, \"event\": {\"type\":","\"\"","","","","","","} } ] }","",""]
[null,null,null,null,null,null,null,null,null,"{","",", \"actions\": [{\"trigger\": {\"type\": \"timestamp\", \"data\": \"",0,"\"}, \"event\": {\"type\":","\"\"","","","","","","} } ] }","",""]
[null,null,null,null,null,null,null,null,null,"{","",", \"actions\": [{\"trigger\": {\"type\": \"timestamp\", \"data\": \"",0,"\"}, \"event\": {\"type\":","\"\"","","","","","","} } ] }","",""]
[null,null,null,null,null,null,null,null,null,"{","",", \"actions\": [{\"trigger\": {\"type\": \"timestamp\", \"data\": \"",0,"\"}, \"event\": {\"type\":","\"\"","","","","","","} } ] }","",""]
[null,null,null,null,null,null,null,null,null,"{","",", \"actions\": [{\"trigger\": {\"type\": \"timestamp\", \"data\": \"",0,"\"}, \"event\": {\"type\":","\"\"","","","","","","} } ] }","",""]
[null,null,null,null,null,null,null,null,null,"{","",", \"actions\": [{\"trigger\": {\"type\": \"timestamp\", \"data\": \"",0,"\"}, \"event\": {\"type\":","\"\"","","","","","","} } ] }","",""]
[null,null,null,null,null,null,null,null,null,"{","",", \"actions\": [{\"trigger\": {\"type\": \"timestamp\", \"data\": \"",0,"\"}, \"event\": {\"type\":","\"\"","","","","","","} } ] }","",""]
[null,null,null,null,null,null,null,null,null,"{","",", \"actions\": [{\"trigger\": {\"type\": \"timestamp\", \"data\": \"",0,"\"}, \"event\": {\"type\":","\"\"","","","","","","} } ] }","",""]
[null,null,null,null,null,null,null,null,null,"{","",", \"actions\": [{\"trigger\": {\"type\": \"timestamp\", \"data\": \"",0,"\"}, \"event\": {\"type\":","\"\"","","","","","","} } ] }","",""]
[null,null,null,null,null,null,null,null,null,"{","",", \"actions\": [{\"trigger\": {\"type\": \"timestamp\", \"data\": \"",0,"\"}, \"event\": {\"type\":","\"\"","","","","","","} } ] }","",""]
[null,null,null,null,null,null,null,null,null,"{","",", \"actions\": [{\"trigger\": {\"type\": \"timestamp\", \"data\": \"",0,"\"}, \"event\": {\"type\":","\"\"","","","","","","} } ] }","",""]
[null,null,null,null,null,null,null,null,null,"{","",", \"actions\": [{\"trigger\": {\"type\": \"timestamp\", \"data\": \"",0,"\"}, \"event\": {\"type\":","\"\"","","","","","","} } ] }","",""]
[null,null,null,null,null,null,null,null,null,"{","",", \"actions\": [{\"trigger\": {\"type\": \"timestamp\", \"data\": \"",0,"\"}, \"event\": {\"type\":","\"\"","","","","","","} } ] }","",""]
[null,null,null,null,null,null,null,null,null,"{","",", \"actions\": [{\"trigger\": {\"type\": \"timestamp\", \"data\": \"",0,"\"}, \"event\": {\"type\":","\"\"","","","","","","} } ] }","",""]
[null,null,null,null,null,null,null,null,null,"{","",", \"actions\": [{\"trigger\": {\"type\": \"timestamp\", \"data\": \"",0,"\"}, \"event\": {\"type\":","\"\"","","","","","","} } ] }","",""]
[null,null,null,null,null,null,null,null,null,"{","",", \"actions\": [{\"trigger\": {\"type\": \"timestamp\", \"data\": \"",0,"\"}, \"event\": {\"type\":","\"\"","","","","","","} } ] }","",""]
[null,null,null,null,null,null,null,null,null,"{","",", \"actions\": [{\"trigger\": {\"type\": \"timestamp\", \"data\": \"",0,"\"}, \"event\": {\"type\":","\"\"","","","","","","} } ] }","",""]
[null,null,null,null,null,null,null,null,null,"{","",", \"actions\": [{\"trigger\": {\"type\": \"timestamp\", \"data\": \"",0,"\"}, \"event\": {\"type\":","\"\"","","","","","","} } ] }","",""]
[null,null,null,null,null,null,null,null,null,"{","",", \"actions\": [{\"trigger\": {\"type\": \"timestamp\", \"data\": \"",0,"\"}, \"event\": {\"type\":","\"\"","","","","","","} } ] }","",""]
[null,null,null,null,null,null,null,null,null,"{","",", \"actions\": [{\"trigger\": {\"type\": \"timestamp\", \"data\": \"",0,"\"}, \"event\": {\"type\":","\"\"","","","","","","} } ] }","",""]
[null,null,null,null,null,null,null,null,null,"{","",", \"actions\": [{\"trigger\": {\"type\": \"timestamp\", \"data\": \"",0,"\"}, \"event\": {\"type\":","\"\"","","","","","","} } ] }","",""]
[null,null,null,null,null,null,null,null,null,"{","",", \"actions\": [{\"trigger\": {\"type\": \"timestamp\", \"data\": \"",0,"\"}, \"event\": {\"type\":","\"\"","","","","","","} } ] }","",""]
[null,null,null,null,null,null,null,null,null,"{","",", \"actions\": [{\"trigger\": {\"type\": \"timestamp\", \"data\": \"",0,"\"}, \"event\": {\"type\":","\"\"","","","","","","} } ] }","",""]
[null,null,null,null,null,null,null,null,null,"{",{"$f":"IF(A463<>\"\",CONCATENATE(\"\"\"\",A$3,\"\"\": \"\"\",$B$1,A463,\"\"\"\"),\"\")","v":""},", \"actions\": [{\"trigger\": {\"type\": \"timestamp\", \"data\": \"",{"$f":"B463*1000","v":0},"\"}, \"event\": {\"type\":",{"$f":"CONCATENATE(\"\"\"\",C463,\"\"\"\")","v":"\"\""},{"$f":"IF(D463<>\"\",CONCATENATE(\",\"\"\",D$3,\"\"\": \"\"\",D463,\"\"\"\"),\"\")","v":""},{"$f":"IF(E463<>\"\",CONCATENATE(\",\"\"\",E$3,\"\"\": \"\"\",E463,\"\"\"\"),\"\")","v":""},{"$f":"IF(F463<>\"\",CONCATENATE(\",\"\"\",F$3,\"\"\": \",F463),\"\")","v":""},{"$f":"IF(G463<>\"\",CONCATENATE(\",\"\"\",G$3,\"\"\": \",G463),\"\")","v":""},{"$f":"IF(H463<>\"\",CONCATENATE(\",\"\"\",H$3,\"\"\": \"\"\",H463,\"\"\"\"),\"\")","v":""},"} } ] }",{"$f":"IF(A463<>\"\",CONCATENATE(J463,K463,L463,M463,N463,O463,P463,Q463,R463,S463,T463,U463),\"\")","v":""},{"$f":"CONCATENATE(IF(AND(W462<>\"\",X462=\"\"),CONCATENATE(W462,IF(A463<>\"\",\",\",\"\")),\"\"),V463)","v":""}]
[null,null,null,null,null,null,null,null,null,"{","",", \"actions\": [{\"trigger\": {\"type\": \"timestamp\", \"data\": \"",0,"\"}, \"event\": {\"type\":","\"\"","","","","","","} } ] }","",""]
[null,null,null,null,null,null,null,null,null,"{","",", \"actions\": [{\"trigger\": {\"type\": \"timestamp\", \"data\": \"",0,"\"}, \"event\": {\"type\":","\"\"","","","","","","} } ] }","",""]
[null,null,null,null,null,null,null,null,null,"{","",", \"actions\": [{\"trigger\": {\"type\": \"timestamp\", \"data\": \"",0,"\"}, \"event\": {\"type\":","\"\"","","","","","","} } ] }","",""]
[null,null,null,null,null,null,null,null,null,"{","",", \"actions\": [{\"trigger\": {\"type\": \"timestamp\", \"data\": \"",0,"\"}, \"event\": {\"type\":","\"\"","","","","","","} } ] }","",""]
[null,null,null,null,null,null,null,null,null,"{","",", \"actions\": [{\"trigger\": {\"type\": \"timestamp\", \"data\": \"",0,"\"}, \"event\": {\"type\":","\"\"","","","","","","} } ] }","",""]
[null,null,null,null,null,null,null,null,null,"{","",", \"actions\": [{\"trigger\": {\"type\": \"timestamp\", \"data\": \"",0,"\"}, \"event\": {\"type\":","\"\"","","","","","","} } ] }","",""]
[null,null,null,null,null,null,null,null,null,"{","",", \"actions\": [{\"trigger\": {\"type\": \"timestamp\", \"data\": \"",0,"\"}, \"event\": {\"type\":","\"\"","","","","","","} } ] }","",""]
[null,null,null,null,null,null,null,null,null,"{","",", \"actions\": [{\"trigger\": {\"type\": \"timestamp\", \"data\": \"",0,"\"}, \"event\": {\"type\":","\"\"","","","","","","} } ] }","",""]
[null,null,null,null,null,null,null,null,null,"{","",", \"actions\": [{\"trigger\": {\"type\": \"timestamp\", \"data\": \"",0,"\"}, \"event\": {\"type\":","\"\"","","","","","","} } ] }","",""]
[null,null,null,null,null,null,null,null,null,"{","",", \"actions\": [{\"trigger\": {\"type\": \"timestamp\", \"data\": \"",0,"\"}, \"event\": {\"type\":","\"\"","","","","","","} } ] }","",""]
[null,null,null,null,null,null,null,null,null,"{","",", \"actions\": [{\"trigger\": {\"type\": \"timestamp\", \"data\": \"",0,"\"}, \"event\": {\"type\":","\"\"","","","","","","} } ] }","",""]
[null,null,null,null,null,null,null,null,null,"{","",", \"actions\": [{\"trigger\": {\"type\": \"timestamp\", \"data\": \"",0,"\"}, \"event\": {\"type\":","\"\"","","","","","","} } ] }","",""]
[null,null,null,null,null,null,null,null,null,"{","",", \"actions\": [{\"trigger\": {\"type\": \"timestamp\", \"data\": \"",0,"\"}, \"event\": {\"type\":","\"\"","","","","","","} } ] }","",""]
[null,null,null,null,null,null,null,null,null,"{","",", \"actions\": [{\"trigger\": {\"type\": \"timestamp\", \"data\": \"",0,"\"}, \"event\": {\"type\":","\"\"","","","","","","} } ] }","",""]
[null,null,null,null,null,null,null,null,null,"{","",", \"actions\": [{\"trigger\": {\"type\": \"timestamp\", \"data\": \"",0,"\"}, \"event\": {\"type\":","\"\"","","","","","","} } ] }","",""]
[null,null,null,null,null,null,null,null,null,"{","",", \"actions\": [{\"trigger\": {\"type\": \"timestamp\", \"data\": \"",0,"\"}, \"event\": {\"type\":","\"\"","","","","","","} } ] }","",""]
[null,null,null,null,null,null,null,null,null,"{","",", \"actions\": [{\"trigger\": {\"type\": \"timestamp\", \"data\": \"",0,"\"}, \"event\": {\"type\":","\"\"","","","","","","} } ] }","",""]
[null,null,null,null,null,null,null,null,null,"{","",", \"actions\": [{\"trigger\": {\"type\": \"timestamp\", \"data\": \"",0,"\"}, \"event\": {\"type\":","\"\"","","","","","","} } ] }","",""]
[null,null,null,null,null,null,null,null,null,"{","",", \"actions\": [{\"trigger\": {\"type\": \"timestamp\", \"data\": \"",0,"\"}, \"event\": {\"type\":","\"\"","","","","","","} } ] }","",""]
[null,null,null,null,null,null,null,null,null,"{","",", \"actions\": [{\"trigger\": {\"type\": \"timestamp\", \"data\": \"",0,"\"}, \"event\": {\"type\":","\"\"","","","","","","} } ] }","",""]
[null,null,null,null,null,null,null,null,null,"{","",", \"actions\": [{\"trigger\": {\"type\": \"timestamp\", \"data\": \"",0,"\"}, \"event\": {\"type\":","\"\"","","","","","","} } ] }","",""]
[null,null,null,null,null,null,null,null,null,"{","",", \"actions\": [{\"trigger\": {\"type\": \"timestamp\", \"data\": \"",0,"\"}, \"event\": {\"type\":","\"\"","","","","","","} } ] }","",""]
[null,null,null,null,null,null,null,null,null,"{","",", \"actions\": [{\"trigger\": {\"type\": \"timestamp\", \"data\": \"",0,"\"}, \"event\": {\"type\":","\"\"","","","","","","} } ] }","",""]
[null,null,null,null,null,null,null,null,null,"{","",", \"actions\": [{\"trigger\": {\"type\": \"timestamp\", \"data\": \"",0,"\"}, \"event\": {\"type\":","\"\"","","","","","","} } ] }","",""]
[null,null,null,null,null,null,null,null,null,"{","",", \"actions\": [{\"trigger\": {\"type\": \"timestamp\", \"data\": \"",0,"\"}, \"event\": {\"type\":","\"\"","","","","","","} } ] }","",""]
[null,null,null,null,null,null,null,null,null,"{","",", \"actions\": [{\"trigger\": {\"type\": \"timestamp\", \"data\": \"",0,"\"}, \"event\": {\"type\":","\"\"","","","","","","} } ] }","",""]
[null,null,null,null,null,null,null,null,null,"{","",", \"actions\": [{\"trigger\": {\"type\": \"timestamp\", \"data\": \"",0,"\"}, \"event\": {\"type\":","\"\"","","","","","","} } ] }","",""]
[null,null,null,null,null,null,null,null,null,"{","",", \"actions\": [{\"trigger\": {\"type\": \"timestamp\", \"data\": \"",0,"\"}, \"event\": {\"type\":","\"\"","","","","","","} } ] }","",""]
[null,null,null,null,null,null,null,null,null,"{","",", \"actions\": [{\"trigger\": {\"type\": \"timestamp\", \"data\": \"",0,"\"}, \"event\": {\"type\":","\"\"","","","","","","} } ] }","",""]
[null,null,null,null,null,null,null,null,null,"{","",", \"actions\": [{\"trigger\": {\"type\": \"timestamp\", \"data\": \"",0,"\"}, \"event\": {\"type\":","\"\"","","","","","","} } ] }","",""]
[null,null,null,null,null,null,null,null,null,"{","",", \"actions\": [{\"trigger\": {\"type\": \"timestamp\", \"data\": \"",0,"\"}, \"event\": {\"type\":","\"\"","","","","","","} } ] }","",""]
[null,null,null,null,null,null,null,null,null,"{","",", \"actions\": [{\"trigger\": {\"type\": \"timestamp\", \"data\": \"",0,"\"}, \"event\": {\"type\":","\"\"","","","","","","} } ] }","",""]
[null,null,null,null,null,null,null,null,null,"{","",", \"actions\": [{\"trigger\": {\"type\": \"timestamp\", \"data\": \"",0,"\"}, \"event\": {\"type\":","\"\"","","","","","","} } ] }","",""]
[null,null,null,null,null,null,null,null,null,"{","",", \"actions\": [{\"trigger\": {\"type\": \"timestamp\", \"data\": \"",0,"\"}, \"event\": {\"type\":","\"\"","","","","","","} } ] }","",""]
[null,null,null,null,null,null,null,null,null,"{","",", \"actions\": [{\"trigger\": {\"type\": \"timestamp\", \"data\": \"",0,"\"}, \"event\": {\"type\":","\"\"","","","","","","} } ] }","",""]
[null,null,null,null,null,null,null,null,null,"{","",", \"actions\": [{\"trigger\": {\"type\": \"timestamp\", \"data\": \"",0,"\"}, \"event\": {\"type\":","\"\"","","","","","","} } ] }","",""]
[null,null,null,null,null,null,null,null,null,"{","",", \"actions\": [{\"trigger\": {\"type\": \"timestamp\", \"data\": \"",0,"\"}, \"event\": {\"type\":","\"\"","","","","","","} } ] }","",""]
[null,null,null,null,null,null,null,null,null,"{","",", \"actions\": [{\"trigger\": {\"type\": \"timestamp\", \"data\": \"",0,"\"}, \"event\": {\"type\":","\"\"","","","","","","} } ] }","",""]
[null,null,null,null,null,null,null,null,null,"{","",", \"actions\": [{\"trigger\": {\"type\": \"timestamp\", \"data\": \"",0,"\"}, \"event\": {\"type\":","\"\"","","","","","","} } ] }","",""]
[null,null,null,null,null,null,null,null,null,"{","",", \"actions\": [{\"trigger\": {\"type\": \"timestamp\", \"data\": \"",0,"\"}, \"event\": {\"type\":","\"\"","","","","","","} } ] }","",""]
[null,null,null,null,null,null,null,null,null,"{","",", \"actions\": [{\"trigger\": {\"type\": \"timestamp\", \"data\": \"",0,"\"}, \"event\": {\"type\":","\"\"","","","","","","} } ] }","",""]
[null,null,null,null,null,null,null,null,null,"{","",", \"actions\": [{\"trigger\": {\"type\": \"timestamp\", \"data\": \"",0,"\"}, \"event\": {\"type\":","\"\"","","","","","","} } ] }","",""]
[null,null,null,null,null,null,null,null,null,"{","",", \"actions\": [{\"trigger\": {\"type\": \"timestamp\", \"data\": \"",0,"\"}, \"event\": {\"type\":","\"\"","","","","","","} } ] }","",""]
[null,null,null,null,null,null,null,null,null,"{","",", \"actions\": [{\"trigger\": {\"type\": \"timestamp\", \"data\": \"",0,"\"}, \"event\": {\"type\":","\"\"","","","","","","} } ] }","",""]
[null,null,null,null,null,null,null,null,null,"{","",", \"actions\": [{\"trigger\": {\"type\": \"timestamp\", \"data\": \"",0,"\"}, \"event\": {\"type\":","\"\"","","","","","","} } ] }","",""]
[null,null,null,null,null,null,null,null,null,"{","",", \"actions\": [{\"trigger\": {\"type\": \"timestamp\", \"data\": \"",0,"\"}, \"event\": {\"type\":","\"\"","","","","","","} } ] }","",""]
[null,null,null,null,null,null,null,null,null,"{","",", \"actions\": [{\"trigger\": {\"type\": \"timestamp\", \"data\": \"",0,"\"}, \"event\": {\"type\":","\"\"","","","","","","} } ] }","",""]
[null,null,null,null,null,null,null,null,null,"{","",", \"actions\": [{\"trigger\": {\"type\": \"timestamp\", \"data\": \"",0,"\"}, \"event\": {\"type\":","\"\"","","","","","","} } ] }","",""]
[null,null,null,null,null,null,null,null,null,"{","",", \"actions\": [{\"trigger\": {\"type\": \"timestamp\", \"data\": \"",0,"\"}, \"event\": {\"type\":","\"\"","","","","","","} } ] }","",""]
[null,null,null,null,null,null,null,null,null,"{","",", \"actions\": [{\"trigger\": {\"type\": \"timestamp\", \"data\": \"",0,"\"}, \"event\": {\"type\":","\"\"","","","","","","} } ] }","",""]
[null,null,null,null,null,null,null,null,null,"{","",", \"actions\": [{\"trigger\": {\"type\": \"timestamp\", \"data\": \"",0,"\"}, \"event\": {\"type\":","\"\"","","","","","","} } ] }","",""]
[null,null,null,null,null,null,null,null,null,"{","",", \"actions\": [{\"trigger\": {\"type\": \"timestamp\", \"data\": \"",0,"\"}, \"event\": {\"type\":","\"\"","","","","","","} } ] }","",""]
[null,null,null,null,null,null,null,null,null,"{","",", \"actions\": [{\"trigger\": {\"type\": \"timestamp\", \"data\": \"",0,"\"}, \"event\": {\"type\":","\"\"","","","","","","} } ] }","",""]
[null,null,null,null,null,null,null,null,null,"{","",", \"actions\": [{\"trigger\": {\"type\": \"timestamp\", \"data\": \"",0,"\"}, \"event\": {\"type\":","\"\"","","","","","","} } ] }","",""]
[null,null,null,null,null,null,null,null,null,"{","",", \"actions\": [{\"trigger\": {\"type\": \"timestamp\", \"data\": \"",0,"\"}, \"event\": {\"type\":","\"\"","","","","","","} } ] }","",""]
[null,null,null,null,null,null,null,null,null,"{","",", \"actions\": [{\"trigger\": {\"type\": \"timestamp\", \"data\": \"",0,"\"}, \"event\": {\"type\":","\"\"","","","","","","} } ] }","",""]
[null,null,null,null,null,null,null,null,null,"{","",", \"actions\": [{\"trigger\": {\"type\": \"timestamp\", \"data\": \"",0,"\"}, \"event\": {\"type\":","\"\"","","","","","","} } ] }","",""]
[null,null,null,null,null,null,null,null,null,"{","",", \"actions\": [{\"trigger\": {\"type\": \"timestamp\", \"data\": \"",0,"\"}, \"event\": {\"type\":","\"\"","","","","","","} } ] }","",""]
[null,null,null,null,null,null,null,null,null,"{","",", \"actions\": [{\"trigger\": {\"type\": \"timestamp\", \"data\": \"",0,"\"}, \"event\": {\"type\":","\"\"","","","","","","} } ] }","",""]
[null,null,null,null,null,null,null,null,null,"{","",", \"actions\": [{\"trigger\": {\"type\": \"timestamp\", \"data\": \"",0,"\"}, \"event\": {\"type\":","\"\"","","","","","","} } ] }","",""]
[null,null,null,null,null,null,null,null,null,"{","",", \"actions\": [{\"trigger\": {\"type\": \"timestamp\", \"data\": \"",0,"\"}, \"event\": {\"type\":","\"\"","","","","","","} } ] }","",""]
[null,null,null,null,null,null,null,null,null,"{","",", \"actions\": [{\"trigger\": {\"type\": \"timestamp\", \"data\": \"",0,"\"}, \"event\": {\"type\":","\"\"","","","","","","} } ] }","",""]
[null,null,null,null,null,null,null,null,null,"{","",", \"actions\": [{\"trigger\": {\"type\": \"timestamp\", \"data\": \"",0,"\"}, \"event\": {\"type\":","\"\"","","","","","","} } ] }","",""]
[null,null,null,null,null,null,null,null,null,"{",{"$f":"IF(A527<>\"\",CONCATENATE(\"\"\"\",A$3,\"\"\": \"\"\",$B$1,A527,\"\"\"\"),\"\")","v":""},", \"actions\": [{\"trigger\": {\"type\": \"timestamp\", \"data\": \"",{"$f":"B527*1000","v":0},"\"}, \"event\": {\"type\":",{"$f":"CONCATENATE(\"\"\"\",C527,\"\"\"\")","v":"\"\""},{"$f":"IF(D527<>\"\",CONCATENATE(\",\"\"\",D$3,\"\"\": \"\"\",D527,\"\"\"\"),\"\")","v":""},{"$f":"IF(E527<>\"\",CONCATENATE(\",\"\"\",E$3,\"\"\": \"\"\",E527,\"\"\"\"),\"\")","v":""},{"$f":"IF(F527<>\"\",CONCATENATE(\",\"\"\",F$3,\"\"\": \",F527),\"\")","v":""},{"$f":"IF(G527<>\"\",CONCATENATE(\",\"\"\",G$3,\"\"\": \",G527),\"\")","v":""},{"$f":"IF(H527<>\"\",CONCATENATE(\",\"\"\",H$3,\"\"\": \"\"\",H527,\"\"\"\"),\"\")","v":""},"} } ] }",{"$f":"IF(A527<>\"\",CONCATENATE(J527,K527,L527,M527,N527,O527,P527,Q527,R527,S527,T527,U527),\"\")","v":""},{"$f":"CONCATENATE(IF(AND(W526<>\"\",X526=\"\"),CONCATENATE(W526,IF(A527<>\"\",\",\",\"\")),\"\"),V527)","v":""}]
[null,null,null,null,null,null,null,null,null,"{","",", \"actions\": [{\"trigger\": {\"type\": \"timestamp\", \"data\": \"",0,"\"}, \"event\": {\"type\":","\"\"","","","","","","} } ] }","",""]
[null,null,null,null,null,null,null,null,null,"{","",", \"actions\": [{\"trigger\": {\"type\": \"timestamp\", \"data\": \"",0,"\"}, \"event\": {\"type\":","\"\"","","","","","","} } ] }","",""]
[null,null,null,null,null,null,null,null,null,"{","",", \"actions\": [{\"trigger\": {\"type\": \"timestamp\", \"data\": \"",0,"\"}, \"event\": {\"type\":","\"\"","","","","","","} } ] }","",""]
[null,null,null,null,null,null,null,null,null,"{","",", \"actions\": [{\"trigger\": {\"type\": \"timestamp\", \"data\": \"",0,"\"}, \"event\": {\"type\":","\"\"","","","","","","} } ] }","",""]
[null,null,null,null,null,null,null,null,null,"{","",", \"actions\": [{\"trigger\": {\"type\": \"timestamp\", \"data\": \"",0,"\"}, \"event\": {\"type\":","\"\"","","","","","","} } ] }","",""]
[null,null,null,null,null,null,null,null,null,"{","",", \"actions\": [{\"trigger\": {\"type\": \"timestamp\", \"data\": \"",0,"\"}, \"event\": {\"type\":","\"\"","","","","","","} } ] }","",""]
[null,null,null,null,null,null,null,null,null,"{","",", \"actions\": [{\"trigger\": {\"type\": \"timestamp\", \"data\": \"",0,"\"}, \"event\": {\"type\":","\"\"","","","","","","} } ] }","",""]
[null,null,null,null,null,null,null,null,null,"{","",", \"actions\": [{\"trigger\": {\"type\": \"timestamp\", \"data\": \"",0,"\"}, \"event\": {\"type\":","\"\"","","","","","","} } ] }","",""]
[null,null,null,null,null,null,null,null,null,"{","",", \"actions\": [{\"trigger\": {\"type\": \"timestamp\", \"data\": \"",0,"\"}, \"event\": {\"type\":","\"\"","","","","","","} } ] }","",""]
[null,null,null,null,null,null,null,null,null,"{","",", \"actions\": [{\"trigger\": {\"type\": \"timestamp\", \"data\": \"",0,"\"}, \"event\": {\"type\":","\"\"","","","","","","} } ] }","",""]
[null,null,null,null,null,null,null,null,null,"{","",", \"actions\": [{\"trigger\": {\"type\": \"timestamp\", \"data\": \"",0,"\"}, \"event\": {\"type\":","\"\"","","","","","","} } ] }","",""]
[null,null,null,null,null,null,null,null,null,"{","",", \"actions\": [{\"trigger\": {\"type\": \"timestamp\", \"data\": \"",0,"\"}, \"event\": {\"type\":","\"\"","","","","","","} } ] }","",""]
[null,null,null,null,null,null,null,null,null,"{","",", \"actions\": [{\"trigger\": {\"type\": \"timestamp\", \"data\": \"",0,"\"}, \"event\": {\"type\":","\"\"","","","","","","} } ] }","",""]
[null,null,null,null,null,null,null,null,null,"{","",", \"actions\": [{\"trigger\": {\"type\": \"timestamp\", \"data\": \"",0,"\"}, \"event\": {\"type\":","\"\"","","","","","","} } ] }","",""]
[null,null,null,null,null,null,null,null,null,"{","",", \"actions\": [{\"trigger\": {\"type\": \"timestamp\", \"data\": \"",0,"\"}, \"event\": {\"type\":","\"\"","","","","","","} } ] }","",""]
[null,null,null,null,null,null,null,null,null,"{","",", \"actions\": [{\"trigger\": {\"type\": \"timestamp\", \"data\": \"",0,"\"}, \"event\": {\"type\":","\"\"","","","","","","} } ] }","",""]
[null,null,null,null,null,null,null,null,null,"{","",", \"actions\": [{\"trigger\": {\"type\": \"timestamp\", \"data\": \"",0,"\"}, \"event\": {\"type\":","\"\"","","","","","","} } ] }","",""]
[null,null,null,null,null,null,null,null,null,"{","",", \"actions\": [{\"trigger\": {\"type\": \"timestamp\", \"data\": \"",0,"\"}, \"event\": {\"type\":","\"\"","","","","","","} } ] }","",""]
[null,null,null,null,null,null,null,null,null,"{","",", \"actions\": [{\"trigger\": {\"type\": \"timestamp\", \"data\": \"",0,"\"}, \"event\": {\"type\":","\"\"","","","","","","} } ] }","",""]
[null,null,null,null,null,null,null,null,null,"{","",", \"actions\": [{\"trigger\": {\"type\": \"timestamp\", \"data\": \"",0,"\"}, \"event\": {\"type\":","\"\"","","","","","","} } ] }","",""]
[null,null,null,null,null,null,null,null,null,"{","",", \"actions\": [{\"trigger\": {\"type\": \"timestamp\", \"data\": \"",0,"\"}, \"event\": {\"type\":","\"\"","","","","","","} } ] }","",""]
[null,null,null,null,null,null,null,null,null,"{","",", \"actions\": [{\"trigger\": {\"type\": \"timestamp\", \"data\": \"",0,"\"}, \"event\": {\"type\":","\"\"","","","","","","} } ] }","",""]
[null,null,null,null,null,null,null,null,null,"{","",", \"actions\": [{\"trigger\": {\"type\": \"timestamp\", \"data\": \"",0,"\"}, \"event\": {\"type\":","\"\"","","","","","","} } ] }","",""]
[null,null,null,null,null,null,null,null,null,"{","",", \"actions\": [{\"trigger\": {\"type\": \"timestamp\", \"data\": \"",0,"\"}, \"event\": {\"type\":","\"\"","","","","","","} } ] }","",""]
[null,null,null,null,null,null,null,null,null,"{","",", \"actions\": [{\"trigger\": {\"type\": \"timestamp\", \"data\": \"",0,"\"}, \"event\": {\"type\":","\"\"","","","","","","} } ] }","",""]
[null,null,null,null,null,null,null,null,null,"{","",", \"actions\": [{\"trigger\": {\"type\": \"timestamp\", \"data\": \"",0,"\"}, \"event\": {\"type\":","\"\"","","","","","","} } ] }","",""]
[null,null,null,null,null,null,null,null,null,"{","",", \"actions\": [{\"trigger\": {\"type\": \"timestamp\", \"data\": \"",0,"\"}, \"event\": {\"type\":","\"\"","","","","","","} } ] }","",""]
[null,null,null,null,null,null,null,null,null,"{","",", \"actions\": [{\"trigger\": {\"type\": \"timestamp\", \"data\": \"",0,"\"}, \"event\": {\"type\":","\"\"","","","","","","} } ] }","",""]
[null,null,null,null,null,null,null,null,null,"{","",", \"actions\": [{\"trigger\": {\"type\": \"timestamp\", \"data\": \"",0,"\"}, \"event\": {\"type\":","\"\"","","","","","","} } ] }","",""]
[null,null,null,null,null,null,null,null,null,"{","",", \"actions\": [{\"trigger\": {\"type\": \"timestamp\", \"data\": \"",0,"\"}, \"event\": {\"type\":","\"\"","","","","","","} } ] }","",""]
[null,null,null,null,null,null,null,null,null,"{","",", \"actions\": [{\"trigger\": {\"type\": \"timestamp\", \"data\": \"",0,"\"}, \"event\": {\"type\":","\"\"","","","","","","} } ] }","",""]
[null,null,null,null,null,null,null,null,null,"{","",", \"actions\": [{\"trigger\": {\"type\": \"timestamp\", \"data\": \"",0,"\"}, \"event\": {\"type\":","\"\"","","","","","","} } ] }","",""]
[null,null,null,null,null,null,null,null,null,"{","",", \"actions\": [{\"trigger\": {\"type\": \"timestamp\", \"data\": \"",0,"\"}, \"event\": {\"type\":","\"\"","","","","","","} } ] }","",""]
[null,null,null,null,null,null,null,null,null,"{","",", \"actions\": [{\"trigger\": {\"type\": \"timestamp\", \"data\": \"",0,"\"}, \"event\": {\"type\":","\"\"","","","","","","} } ] }","",""]
[null,null,null,null,null,null,null,null,null,"{","",", \"actions\": [{\"trigger\": {\"type\": \"timestamp\", \"data\": \"",0,"\"}, \"event\": {\"type\":","\"\"","","","","","","} } ] }","",""]
[null,null,null,null,null,null,null,null,null,"{","",", \"actions\": [{\"trigger\": {\"type\": \"timestamp\", \"data\": \"",0,"\"}, \"event\": {\"type\":","\"\"","","","","","","} } ] }","",""]
[null,null,null,null,null,null,null,null,null,"{","",", \"actions\": [{\"trigger\": {\"type\": \"timestamp\", \"data\": \"",0,"\"}, \"event\": {\"type\":","\"\"","","","","","","} } ] }","",""]
[null,null,null,null,null,null,null,null,null,"{","",", \"actions\": [{\"trigger\": {\"type\": \"timestamp\", \"data\": \"",0,"\"}, \"event\": {\"type\":","\"\"","","","","","","} } ] }","",""]
[null,null,null,null,null,null,null,null,null,"{","",", \"actions\": [{\"trigger\": {\"type\": \"timestamp\", \"data\": \"",0,"\"}, \"event\": {\"type\":","\"\"","","","","","","} } ] }","",""]
[null,null,null,null,null,null,null,null,null,"{","",", \"actions\": [{\"trigger\": {\"type\": \"timestamp\", \"data\": \"",0,"\"}, \"event\": {\"type\":","\"\"","","","","","","} } ] }","",""]
[null,null,null,null,null,null,null,null,null,"{","",", \"actions\": [{\"trigger\": {\"type\": \"timestamp\", \"data\": \"",0,"\"}, \"event\": {\"type\":","\"\"","","","","","","} } ] }","",""]
[null,null,null,null,null,null,null,null,null,"{","",", \"actions\": [{\"trigger\": {\"type\": \"timestamp\", \"data\": \"",0,"\"}, \"event\": {\"type\":","\"\"","","","","","","} } ] }","",""]
[null,null,null,null,null,null,null,null,null,"{","",", \"actions\": [{\"trigger\": {\"type\": \"timestamp\", \"data\": \"",0,"\"}, \"event\": {\"type\":","\"\"","","","","","","} } ] }","",""]
[null,null,null,null,null,null,null,null,null,"{","",", \"actions\": [{\"trigger\": {\"type\": \"timestamp\", \"data\": \"",0,"\"}, \"event\": {\"type\":","\"\"","","","","","","} } ] }","",""]
[null,null,null,null,null,null,null,null,null,"{","",", \"actions\": [{\"trigger\": {\"type\": \"timestamp\", \"data\": \"",0,"\"}, \"event\": {\"type\":","\"\"","","","","","","} } ] }","",""]
[null,null,null,null,null,null,null,null,null,"{","",", \"actions\": [{\"trigger\": {\"type\": \"timestamp\", \"data\": \"",0,"\"}, \"event\": {\"type\":","\"\"","","","","","","} } ] }","",""]
[null,null,null,null,null,null,null,null,null,"{","",", \"actions\": [{\"trigger\": {\"type\": \"timestamp\", \"data\": \"",0,"\"}, \"event\": {\"type\":","\"\"","","","","","","} } ] }","",""]
[null,null,null,null,null,null,null,null,null,"{","",", \"actions\": [{\"trigger\": {\"type\": \"timestamp\", \"data\": \"",0,"\"}, \"event\": {\"type\":","\"\"","","","","","","} } ] }","",""]
[null,null,null,null,null,null,null,null,null,"{","",", \"actions\": [{\"trigger\": {\"type\": \"timestamp\", \"data\": \"",0,"\"}, \"event\": {\"type\":","\"\"","","","","","","} } ] }","",""]
[null,null,null,null,null,null,null,null,null,"{","",", \"actions\": [{\"trigger\": {\"type\": \"timestamp\", \"data\": \"",0,"\"}, \"event\": {\"type\":","\"\"","","","","","","} } ] }","",""]
[null,null,null,null,null,null,null,null,null,"{","",", \"actions\": [{\"trigger\": {\"type\": \"timestamp\", \"data\": \"",0,"\"}, \"event\": {\"type\":","\"\"","","","","","","} } ] }","",""]
[null,null,null,null,null,null,null,null,null,"{","",", \"actions\": [{\"trigger\": {\"type\": \"timestamp\", \"data\": \"",0,"\"}, \"event\": {\"type\":","\"\"","","","","","","} } ] }","",""]
[null,null,null,null,null,null,null,null,null,"{","",", \"actions\": [{\"trigger\": {\"type\": \"timestamp\", \"data\": \"",0,"\"}, \"event\": {\"type\":","\"\"","","","","","","} } ] }","",""]
[null,null,null,null,null,null,null,null,null,"{","",", \"actions\": [{\"trigger\": {\"type\": \"timestamp\", \"data\": \"",0,"\"}, \"event\": {\"type\":","\"\"","","","","","","} } ] }","",""]
[null,null,null,null,null,null,null,null,null,"{","",", \"actions\": [{\"trigger\": {\"type\": \"timestamp\", \"data\": \"",0,"\"}, \"event\": {\"type\":","\"\"","","","","","","} } ] }","",""]
[null,null,null,null,null,null,null,null,null,"{","",", \"actions\": [{\"trigger\": {\"type\": \"timestamp\", \"data\": \"",0,"\"}, \"event\": {\"type\":","\"\"","","","","","","} } ] }","",""]
[null,null,null,null,null,null,null,null,null,"{","",", \"actions\": [{\"trigger\": {\"type\": \"timestamp\", \"data\": \"",0,"\"}, \"event\": {\"type\":","\"\"","","","","","","} } ] }","",""]
[null,null,null,null,null,null,null,null,null,"{","",", \"actions\": [{\"trigger\": {\"type\": \"timestamp\", \"data\": \"",0,"\"}, \"event\": {\"type\":","\"\"","","","","","","} } ] }","",""]
[null,null,null,null,null,null,null,null,null,"{","",", \"actions\": [{\"trigger\": {\"type\": \"timestamp\", \"data\": \"",0,"\"}, \"event\": {\"type\":","\"\"","","","","","","} } ] }","",""]
[null,null,null,null,null,null,null,null,null,"{","",", \"actions\": [{\"trigger\": {\"type\": \"timestamp\", \"data\": \"",0,"\"}, \"event\": {\"type\":","\"\"","","","","","","} } ] }","",""]
[null,null,null,null,null,null,null,null,null,"{","",", \"actions\": [{\"trigger\": {\"type\": \"timestamp\", \"data\": \"",0,"\"}, \"event\": {\"type\":","\"\"","","","","","","} } ] }","","",3]
[null,null,null,null,null,null,null,null,null,"{","",", \"actions\": [{\"trigger\": {\"type\": \"timestamp\", \"data\": \"",0,"\"}, \"event\": {\"type\":","\"\"","","","","","","} } ] }","",""]
[null,null,null,null,null,null,null,null,null,"{","",", \"actions\": [{\"trigger\": {\"type\": \"timestamp\", \"data\": \"",0,"\"}, \"event\": {\"type\":","\"\"","","","","","","} } ] }","",""]
[null,null,null,null,null,null,null,null,null,"{",{"$f":"IF(A591<>\"\",CONCATENATE(\"\"\"\",A$3,\"\"\": \"\"\",$B$1,A591,\"\"\"\"),\"\")","v":""},", \"actions\": [{\"trigger\": {\"type\": \"timestamp\", \"data\": \"",{"$f":"B591*1000","v":0},"\"}, \"event\": {\"type\":",{"$f":"CONCATENATE(\"\"\"\",C591,\"\"\"\")","v":"\"\""},{"$f":"IF(D591<>\"\",CONCATENATE(\",\"\"\",D$3,\"\"\": \"\"\",D591,\"\"\"\"),\"\")","v":""},{"$f":"IF(E591<>\"\",CONCATENATE(\",\"\"\",E$3,\"\"\": \"\"\",E591,\"\"\"\"),\"\")","v":""},{"$f":"IF(F591<>\"\",CONCATENATE(\",\"\"\",F$3,\"\"\": \",F591),\"\")","v":""},{"$f":"IF(G591<>\"\",CONCATENATE(\",\"\"\",G$3,\"\"\": \",G591),\"\")","v":""},{"$f":"IF(H591<>\"\",CONCATENATE(\",\"\"\",H$3,\"\"\": \"\"\",H591,\"\"\"\"),\"\")","v":""},"} } ] }",{"$f":"IF(A591<>\"\",CONCATENATE(J591,K591,L591,M591,N591,O591,P591,Q591,R591,S591,T591,U591),\"\")","v":""},{"$f":"CONCATENATE(IF(AND(W590<>\"\",X590=\"\"),CONCATENATE(W590,IF(A591<>\"\",\",\",\"\")),\"\"),V591)","v":""}]
[null,null,null,null,null,null,null,null,null,"{","",", \"actions\": [{\"trigger\": {\"type\": \"timestamp\", \"data\": \"",0,"\"}, \"event\": {\"type\":","\"\"","","","","","","} } ] }","",""]
[null,null,null,null,null,null,null,null,null,"{","",", \"actions\": [{\"trigger\": {\"type\": \"timestamp\", \"data\": \"",0,"\"}, \"event\": {\"type\":","\"\"","","","","","","} } ] }","",""]
[null,null,null,null,null,null,null,null,null,"{","",", \"actions\": [{\"trigger\": {\"type\": \"timestamp\", \"data\": \"",0,"\"}, \"event\": {\"type\":","\"\"","","","","","","} } ] }","",""]
[null,null,null,null,null,null,null,null,null,"{","",", \"actions\": [{\"trigger\": {\"type\": \"timestamp\", \"data\": \"",0,"\"}, \"event\": {\"type\":","\"\"","","","","","","} } ] }","",""]
[null,null,null,null,null,null,null,null,null,"{","",", \"actions\": [{\"trigger\": {\"type\": \"timestamp\", \"data\": \"",0,"\"}, \"event\": {\"type\":","\"\"","","","","","","} } ] }","",""]
[null,null,null,null,null,null,null,null,null,"{","",", \"actions\": [{\"trigger\": {\"type\": \"timestamp\", \"data\": \"",0,"\"}, \"event\": {\"type\":","\"\"","","","","","","} } ] }","",""]
[null,null,null,null,null,null,null,null,null,"{","",", \"actions\": [{\"trigger\": {\"type\": \"timestamp\", \"data\": \"",0,"\"}, \"event\": {\"type\":","\"\"","","","","","","} } ] }","",""]
[null,null,null,null,null,null,null,null,null,"{","",", \"actions\": [{\"trigger\": {\"type\": \"timestamp\", \"data\": \"",0,"\"}, \"event\": {\"type\":","\"\"","","","","","","} } ] }","",""]
[null,null,null,null,null,null,null,null,null,"{","",", \"actions\": [{\"trigger\": {\"type\": \"timestamp\", \"data\": \"",0,"\"}, \"event\": {\"type\":","\"\"","","","","","","} } ] }","",""]
[null,null,null,null,null,null,null,null,null,"{","",", \"actions\": [{\"trigger\": {\"type\": \"timestamp\", \"data\": \"",0,"\"}, \"event\": {\"type\":","\"\"","","","","","","} } ] }","",""]
[null,null,null,null,null,null,null,null,null,"{","",", \"actions\": [{\"trigger\": {\"type\": \"timestamp\", \"data\": \"",0,"\"}, \"event\": {\"type\":","\"\"","","","","","","} } ] }","",""]
[null,null,null,null,null,null,null,null,null,"{","",", \"actions\": [{\"trigger\": {\"type\": \"timestamp\", \"data\": \"",0,"\"}, \"event\": {\"type\":","\"\"","","","","","","} } ] }","",""]
[null,null,null,null,null,null,null,null,null,"{","",", \"actions\": [{\"trigger\": {\"type\": \"timestamp\", \"data\": \"",0,"\"}, \"event\": {\"type\":","\"\"","","","","","","} } ] }","",""]
[null,null,null,null,null,null,null,null,null,"{","",", \"actions\": [{\"trigger\": {\"type\": \"timestamp\", \"data\": \"",0,"\"}, \"event\": {\"type\":","\"\"","","","","","","} } ] }","",""]
[null,null,null,null,null,null,null,null,null,"{","",", \"actions\": [{\"trigger\": {\"type\": \"timestamp\", \"data\": \"",0,"\"}, \"event\": {\"type\":","\"\"","","","","","","} } ] }","",""]
[null,null,null,null,null,null,null,null,null,"{","",", \"actions\": [{\"trigger\": {\"type\": \"timestamp\", \"data\": \"",0,"\"}, \"event\": {\"type\":","\"\"","","","","","","} } ] }","",""]
[null,null,null,null,null,null,null,null,null,"{","",", \"actions\": [{\"trigger\": {\"type\": \"timestamp\", \"data\": \"",0,"\"}, \"event\": {\"type\":","\"\"","","","","","","} } ] }","",""]
[null,null,null,null,null,null,null,null,null,"{","",", \"actions\": [{\"trigger\": {\"type\": \"timestamp\", \"data\": \"",0,"\"}, \"event\": {\"type\":","\"\"","","","","","","} } ] }","",""]
[null,null,null,null,null,null,null,null,null,"{","",", \"actions\": [{\"trigger\": {\"type\": \"timestamp\", \"data\": \"",0,"\"}, \"event\": {\"type\":","\"\"","","","","","","} } ] }","",""]
[null,null,null,null,null,null,null,null,null,"{","",", \"actions\": [{\"trigger\": {\"type\": \"timestamp\", \"data\": \"",0,"\"}, \"event\": {\"type\":","\"\"","","","","","","} } ] }","",""]
[null,null,null,null,null,null,null,null,null,"{","",", \"actions\": [{\"trigger\": {\"type\": \"timestamp\", \"data\": \"",0,"\"}, \"event\": {\"type\":","\"\"","","","","","","} } ] }","",""]
[null,null,null,null,null,null,null,null,null,"{","",", \"actions\": [{\"trigger\": {\"type\": \"timestamp\", \"data\": \"",0,"\"}, \"event\": {\"type\":","\"\"","","","","","","} } ] }","",""]
[null,null,null,null,null,null,null,null,null,"{","",", \"actions\": [{\"trigger\": {\"type\": \"timestamp\", \"data\": \"",0,"\"}, \"event\": {\"type\":","\"\"","","","","","","} } ] }","",""]
[null,null,null,null,null,null,null,null,null,"{","",", \"actions\": [{\"trigger\": {\"type\": \"timestamp\", \"data\": \"",0,"\"}, \"event\": {\"type\":","\"\"","","","","","","} } ] }","",""]
[null,null,null,null,null,null,null,null,null,"{","",", \"actions\": [{\"trigger\": {\"type\": \"timestamp\", \"data\": \"",0,"\"}, \"event\": {\"type\":","\"\"","","","","","","} } ] }","",""]
[null,null,null,null,null,null,null,null,null,"{","",", \"actions\": [{\"trigger\": {\"type\": \"timestamp\", \"data\": \"",0,"\"}, \"event\": {\"type\":","\"\"","","","","","","} } ] }","",""]
[null,null,null,null,null,null,null,null,null,"{","",", \"actions\": [{\"trigger\": {\"type\": \"timestamp\", \"data\": \"",0,"\"}, \"event\": {\"type\":","\"\"","","","","","","} } ] }","",""]
[null,null,null,null,null,null,null,null,null,"{","",", \"actions\": [{\"trigger\": {\"type\": \"timestamp\", \"data\": \"",0,"\"}, \"event\": {\"type\":","\"\"","","","","","","} } ] }","",""]
[null,null,null,null,null,null,null,null,null,"{","",", \"actions\": [{\"trigger\": {\"type\": \"timestamp\", \"data\": \"",0,"\"}, \"event\": {\"type\":","\"\"","","","","","","} } ] }","",""]
[null,null,null,null,null,null,null,null,null,"{","",", \"actions\": [{\"trigger\": {\"type\": \"timestamp\", \"data\": \"",0,"\"}, \"event\": {\"type\":","\"\"","","","","","","} } ] }","",""]
[null,null,null,null,null,null,null,null,null,"{","",", \"actions\": [{\"trigger\": {\"type\": \"timestamp\", \"data\": \"",0,"\"}, \"event\": {\"type\":","\"\"","","","","","","} } ] }","",""]
[null,null,null,null,null,null,null,null,null,"{","",", \"actions\": [{\"trigger\": {\"type\": \"timestamp\", \"data\": \"",0,"\"}, \"event\": {\"type\":","\"\"","","","","","","} } ] }","",""]
[null,null,null,null,null,null,null,null,null,"{","",", \"actions\": [{\"trigger\": {\"type\": \"timestamp\", \"data\": \"",0,"\"}, \"event\": {\"type\":","\"\"","","","","","","} } ] }","",""]
[null,null,null,null,null,null,null,null,null,"{","",", \"actions\": [{\"trigger\": {\"type\": \"timestamp\", \"data\": \"",0,"\"}, \"event\": {\"type\":","\"\"","","","","","","} } ] }","",""]
[null,null,null,null,null,null,null,null,null,"{","",", \"actions\": [{\"trigger\": {\"type\": \"timestamp\", \"data\": \"",0,"\"}, \"event\": {\"type\":","\"\"","","","","","","} } ] }","",""]
[null,null,null,null,null,null,null,null,null,"{","",", \"actions\": [{\"trigger\": {\"type\": \"timestamp\", \"data\": \"",0,"\"}, \"event\": {\"type\":","\"\"","","","","","","} } ] }","",""]
[null,null,null,null,null,null,null,null,null,"{","",", \"actions\": [{\"trigger\": {\"type\": \"timestamp\", \"data\": \"",0,"\"}, \"event\": {\"type\":","\"\"","","","","","","} } ] }","",""]
[null,null,null,null,null,null,null,null,null,"{","",", \"actions\": [{\"trigger\": {\"type\": \"timestamp\", \"data\": \"",0,"\"}, \"event\": {\"type\":","\"\"","","","","","","} } ] }","",""]
[null,null,null,null,null,null,null,null,null,"{","",", \"actions\": [{\"trigger\": {\"type\": \"timestamp\", \"data\": \"",0,"\"}, \"event\": {\"type\":","\"\"","","","","","","} } ] }","",""]
[null,null,null,null,null,null,null,null,null,"{","",", \"actions\": [{\"trigger\": {\"type\": \"timestamp\", \"data\": \"",0,"\"}, \"event\": {\"type\":","\"\"","","","","","","} } ] }","",""]
[null,null,null,null,null,null,null,null,null,"{","",", \"actions\": [{\"trigger\": {\"type\": \"timestamp\", \"data\": \"",0,"\"}, \"event\": {\"type\":","\"\"","","","","","","} } ] }","",""]
[null,null,null,null,null,null,null,null,null,"{","",", \"actions\": [{\"trigger\": {\"type\": \"timestamp\", \"data\": \"",0,"\"}, \"event\": {\"type\":","\"\"","","","","","","} } ] }","",""]
[null,null,null,null,null,null,null,null,null,"{","",", \"actions\": [{\"trigger\": {\"type\": \"timestamp\", \"data\": \"",0,"\"}, \"event\": {\"type\":","\"\"","","","","","","} } ] }","",""]
[null,null,null,null,null,null,null,null,null,"{","",", \"actions\": [{\"trigger\": {\"type\": \"timestamp\", \"data\": \"",0,"\"}, \"event\": {\"type\":","\"\"","","","","","","} } ] }","",""]
[null,null,null,null,null,null,null,null,null,"{","",", \"actions\": [{\"trigger\": {\"type\": \"timestamp\", \"data\": \"",0,"\"}, \"event\": {\"type\":","\"\"","","","","","","} } ] }","",""]
[null,null,null,null,null,null,null,null,null,"{","",", \"actions\": [{\"trigger\": {\"type\": \"timestamp\", \"data\": \"",0,"\"}, \"event\": {\"type\":","\"\"","","","","","","} } ] }","",""]
[null,null,null,null,null,null,null,null,null,"{","",", \"actions\": [{\"trigger\": {\"type\": \"timestamp\", \"data\": \"",0,"\"}, \"event\": {\"type\":","\"\"","","","","","","} } ] }","",""]
[null,null,null,null,null,null,null,null,null,"{","",", \"actions\": [{\"trigger\": {\"type\": \"timestamp\", \"data\": \"",0,"\"}, \"event\": {\"type\":","\"\"","","","","","","} } ] }","",""]
[null,null,null,null,null,null,null,null,null,"{","",", \"actions\": [{\"trigger\": {\"type\": \"timestamp\", \"data\": \"",0,"\"}, \"event\": {\"type\":","\"\"","","","","","","} } ] }","",""]
[null,null,null,null,null,null,null,null,null,"{","",", \"actions\": [{\"trigger\": {\"type\": \"timestamp\", \"data\": \"",0,"\"}, \"event\": {\"type\":","\"\"","","","","","","} } ] }","",""]
[null,null,null,null,null,null,null,null,null,"{","",", \"actions\": [{\"trigger\": {\"type\": \"timestamp\", \"data\": \"",0,"\"}, \"event\": {\"type\":","\"\"","","","","","","} } ] }","",""]
[null,null,null,null,null,null,null,null,null,"{","",", \"actions\": [{\"trigger\": {\"type\": \"timestamp\", \"data\": \"",0,"\"}, \"event\": {\"type\":","\"\"","","","","","","} } ] }","",""]
[null,null,null,null,null,null,null,null,null,"{","",", \"actions\": [{\"trigger\": {\"type\": \"timestamp\", \"data\": \"",0,"\"}, \"event\": {\"type\":","\"\"","","","","","","} } ] }","",""]
[null,null,null,null,null,null,null,null,null,"{","",", \"actions\": [{\"trigger\": {\"type\": \"timestamp\", \"data\": \"",0,"\"}, \"event\": {\"type\":","\"\"","","","","","","} } ] }","",""]
[null,null,null,null,null,null,null,null,null,"{","",", \"actions\": [{\"trigger\": {\"type\": \"timestamp\", \"data\": \"",0,"\"}, \"event\": {\"type\":","\"\"","","","","","","} } ] }","",""]
[null,null,null,null,null,null,null,null,null,"{","",", \"actions\": [{\"trigger\": {\"type\": \"timestamp\", \"data\": \"",0,"\"}, \"event\": {\"type\":","\"\"","","","","","","} } ] }","",""]
[null,null,null,null,null,null,null,null,null,"{","",", \"actions\": [{\"trigger\": {\"type\": \"timestamp\", \"data\": \"",0,"\"}, \"event\": {\"type\":","\"\"","","","","","","} } ] }","",""]
[null,null,null,null,null,null,null,null,null,"{","",", \"actions\": [{\"trigger\": {\"type\": \"timestamp\", \"data\": \"",0,"\"}, \"event\": {\"type\":","\"\"","","","","","","} } ] }","",""]
[null,null,null,null,null,null,null,null,null,"{","",", \"actions\": [{\"trigger\": {\"type\": \"timestamp\", \"data\": \"",0,"\"}, \"event\": {\"type\":","\"\"","","","","","","} } ] }","",""]
[null,null,null,null,null,null,null,null,null,"{","",", \"actions\": [{\"trigger\": {\"type\": \"timestamp\", \"data\": \"",0,"\"}, \"event\": {\"type\":","\"\"","","","","","","} } ] }","",""]
[null,null,null,null,null,null,null,null,null,"{","",", \"actions\": [{\"trigger\": {\"type\": \"timestamp\", \"data\": \"",0,"\"}, \"event\": {\"type\":","\"\"","","","","","","} } ] }","",""]
[null,null,null,null,null,null,null,null,null,"{","",", \"actions\": [{\"trigger\": {\"type\": \"timestamp\", \"data\": \"",0,"\"}, \"event\": {\"type\":","\"\"","","","","","","} } ] }","",""]
[null,null,null,null,null,null,null,null,null,"{","",", \"actions\": [{\"trigger\": {\"type\": \"timestamp\", \"data\": \"",0,"\"}, \"event\": {\"type\":","\"\"","","","","","","} } ] }","",""]
[null,null,null,null,null,null,null,null,null,"{",{"$f":"IF(A655<>\"\",CONCATENATE(\"\"\"\",A$3,\"\"\": \"\"\",$B$1,A655,\"\"\"\"),\"\")","v":""},", \"actions\": [{\"trigger\": {\"type\": \"timestamp\", \"data\": \"",{"$f":"B655*1000","v":0},"\"}, \"event\": {\"type\":",{"$f":"CONCATENATE(\"\"\"\",C655,\"\"\"\")","v":"\"\""},{"$f":"IF(D655<>\"\",CONCATENATE(\",\"\"\",D$3,\"\"\": \"\"\",D655,\"\"\"\"),\"\")","v":""},{"$f":"IF(E655<>\"\",CONCATENATE(\",\"\"\",E$3,\"\"\": \"\"\",E655,\"\"\"\"),\"\")","v":""},{"$f":"IF(F655<>\"\",CONCATENATE(\",\"\"\",F$3,\"\"\": \",F655),\"\")","v":""},{"$f":"IF(G655<>\"\",CONCATENATE(\",\"\"\",G$3,\"\"\": \",G655),\"\")","v":""},{"$f":"IF(H655<>\"\",CONCATENATE(\",\"\"\",H$3,\"\"\": \"\"\",H655,\"\"\"\"),\"\")","v":""},"} } ] }",{"$f":"IF(A655<>\"\",CONCATENATE(J655,K655,L655,M655,N655,O655,P655,Q655,R655,S655,T655,U655),\"\")","v":""},{"$f":"CONCATENATE(IF(AND(W654<>\"\",X654=\"\"),CONCATENATE(W654,IF(A655<>\"\",\",\",\"\")),\"\"),V655)","v":""}]
[null,null,null,null,null,null,null,null,null,"{","",", \"actions\": [{\"trigger\": {\"type\": \"timestamp\", \"data\": \"",0,"\"}, \"event\": {\"type\":","\"\"","","","","","","} } ] }","",""]
[null,null,null,null,null,null,null,null,null,"{","",", \"actions\": [{\"trigger\": {\"type\": \"timestamp\", \"data\": \"",0,"\"}, \"event\": {\"type\":","\"\"","","","","","","} } ] }","",""]
[null,null,null,null,null,null,null,null,null,"{","",", \"actions\": [{\"trigger\": {\"type\": \"timestamp\", \"data\": \"",0,"\"}, \"event\": {\"type\":","\"\"","","","","","","} } ] }","",""]
[null,null,null,null,null,null,null,null,null,"{","",", \"actions\": [{\"trigger\": {\"type\": \"timestamp\", \"data\": \"",0,"\"}, \"event\": {\"type\":","\"\"","","","","","","} } ] }","",""]
[null,null,null,null,null,null,null,null,null,"{","",", \"actions\": [{\"trigger\": {\"type\": \"timestamp\", \"data\": \"",0,"\"}, \"event\": {\"type\":","\"\"","","","","","","} } ] }","",""]
[null,null,null,null,null,null,null,null,null,"{","",", \"actions\": [{\"trigger\": {\"type\": \"timestamp\", \"data\": \"",0,"\"}, \"event\": {\"type\":","\"\"","","","","","","} } ] }","",""]
[null,null,null,null,null,null,null,null,null,"{","",", \"actions\": [{\"trigger\": {\"type\": \"timestamp\", \"data\": \"",0,"\"}, \"event\": {\"type\":","\"\"","","","","","","} } ] }","",""]
[null,null,null,null,null,null,null,null,null,"{","",", \"actions\": [{\"trigger\": {\"type\": \"timestamp\", \"data\": \"",0,"\"}, \"event\": {\"type\":","\"\"","","","","","","} } ] }","",""]
[null,null,null,null,null,null,null,null,null,"{","",", \"actions\": [{\"trigger\": {\"type\": \"timestamp\", \"data\": \"",0,"\"}, \"event\": {\"type\":","\"\"","","","","","","} } ] }","",""]
[null,null,null,null,null,null,null,null,null,"{","",", \"actions\": [{\"trigger\": {\"type\": \"timestamp\", \"data\": \"",0,"\"}, \"event\": {\"type\":","\"\"","","","","","","} } ] }","",""]
[null,null,null,null,null,null,null,null,null,"{","",", \"actions\": [{\"trigger\": {\"type\": \"timestamp\", \"data\": \"",0,"\"}, \"event\": {\"type\":","\"\"","","","","","","} } ] }","",""]
[null,null,null,null,null,null,null,null,null,"{","",", \"actions\": [{\"trigger\": {\"type\": \"timestamp\", \"data\": \"",0,"\"}, \"event\": {\"type\":","\"\"","","","","","","} } ] }","",""]
[null,null,null,null,null,null,null,null,null,"{","",", \"actions\": [{\"trigger\": {\"type\": \"timestamp\", \"data\": \"",0,"\"}, \"event\": {\"type\":","\"\"","","","","","","} } ] }","",""]
[null,null,null,null,null,null,null,null,null,"{","",", \"actions\": [{\"trigger\": {\"type\": \"timestamp\", \"data\": \"",0,"\"}, \"event\": {\"type\":","\"\"","","","","","","} } ] }","",""]
[null,null,null,null,null,null,null,null,null,"{","",", \"actions\": [{\"trigger\": {\"type\": \"timestamp\", \"data\": \"",0,"\"}, \"event\": {\"type\":","\"\"","","","","","","} } ] }","",""]
[null,null,null,null,null,null,null,null,null,"{","",", \"actions\": [{\"trigger\": {\"type\": \"timestamp\", \"data\": \"",0,"\"}, \"event\": {\"type\":","\"\"","","","","","","} } ] }","",""]
[null,null,null,null,null,null,null,null,null,"{","",", \"actions\": [{\"trigger\": {\"type\": \"timestamp\", \"data\": \"",0,"\"}, \"event\": {\"type\":","\"\"","","","","","","} } ] }","",""]
[null,null,null,null,null,null,null,null,null,"{","",", \"actions\": [{\"trigger\": {\"type\": \"timestamp\", \"data\": \"",0,"\"}, \"event\": {\"type\":","\"\"","","","","","","} } ] }","",""]
[null,null,null,null,null,null,null,null,null,"{","",", \"actions\": [{\"trigger\": {\"type\": \"timestamp\", \"data\": \"",0,"\"}, \"event\": {\"type\":","\"\"","","","","","","} } ] }","",""]
[null,null,null,null,null,null,null,null,null,"{","",", \"actions\": [{\"trigger\": {\"type\": \"timestamp\", \"data\": \"",0,"\"}, \"event\": {\"type\":","\"\"","","","","","","} } ] }","",""]
[null,null,null,null,null,null,null,null,null,"{","",", \"actions\": [{\"trigger\": {\"type\": \"timestamp\", \"data\": \"",0,"\"}, \"event\": {\"type\":","\"\"","","","","","","} } ] }","",""]
[null,null,null,null,null,null,null,null,null,"{","",", \"actions\": [{\"trigger\": {\"type\": \"timestamp\", \"data\": \"",0,"\"}, \"event\": {\"type\":","\"\"","","","","","","} } ] }","",""]
[null,null,null,null,null,null,null,null,null,"{","",", \"actions\": [{\"trigger\": {\"type\": \"timestamp\", \"data\": \"",0,"\"}, \"event\": {\"type\":","\"\"","","","","","","} } ] }","",""]
[null,null,null,null,null,null,null,null,null,"{","",", \"actions\": [{\"trigger\": {\"type\": \"timestamp\", \"data\": \"",0,"\"}, \"event\": {\"type\":","\"\"","","","","","","} } ] }","",""]
[null,null,null,null,null,null,null,null,null,"{","",", \"actions\": [{\"trigger\": {\"type\": \"timestamp\", \"data\": \"",0,"\"}, \"event\": {\"type\":","\"\"","","","","","","} } ] }","",""]
[null,null,null,null,null,null,null,null,null,"{","",", \"actions\": [{\"trigger\": {\"type\": \"timestamp\", \"data\": \"",0,"\"}, \"event\": {\"type\":","\"\"","","","","","","} } ] }","",""]
[null,null,null,null,null,null,null,null,null,"{","",", \"actions\": [{\"trigger\": {\"type\": \"timestamp\", \"data\": \"",0,"\"}, \"event\": {\"type\":","\"\"","","","","","","} } ] }","",""]
[null,null,null,null,null,null,null,null,null,"{","",", \"actions\": [{\"trigger\": {\"type\": \"timestamp\", \"data\": \"",0,"\"}, \"event\": {\"type\":","\"\"","","","","","","} } ] }","",""]
[null,null,null,null,null,null,null,null,null,"{","",", \"actions\": [{\"trigger\": {\"type\": \"timestamp\", \"data\": \"",0,"\"}, \"event\": {\"type\":","\"\"","","","","","","} } ] }","",""]
[null,null,null,null,null,null,null,null,null,"{","",", \"actions\": [{\"trigger\": {\"type\": \"timestamp\", \"data\": \"",0,"\"}, \"event\": {\"type\":","\"\"","","","","","","} } ] }","",""]
[null,null,null,null,null,null,null,null,null,"{","",", \"actions\": [{\"trigger\": {\"type\": \"timestamp\", \"data\": \"",0,"\"}, \"event\": {\"type\":","\"\"","","","","","","} } ] }","",""]
[null,null,null,null,null,null,null,null,null,"{","",", \"actions\": [{\"trigger\": {\"type\": \"timestamp\", \"data\": \"",0,"\"}, \"event\": {\"type\":","\"\"","","","","","","} } ] }","",""]
[null,null,null,null,null,null,null,null,null,"{","",", \"actions\": [{\"trigger\": {\"type\": \"timestamp\", \"data\": \"",0,"\"}, \"event\": {\"type\":","\"\"","","","","","","} } ] }","",""]
[null,null,null,null,null,null,null,null,null,"{","",", \"actions\": [{\"trigger\": {\"type\": \"timestamp\", \"data\": \"",0,"\"}, \"event\": {\"type\":","\"\"","","","","","","} } ] }","",""]
[null,null,null,null,null,null,null,null,null,"{","",", \"actions\": [{\"trigger\": {\"type\": \"timestamp\", \"data\": \"",0,"\"}, \"event\": {\"type\":","\"\"","","","","","","} } ] }","",""]
[null,null,null,null,null,null,null,null,null,"{","",", \"actions\": [{\"trigger\": {\"type\": \"timestamp\", \"data\": \"",0,"\"}, \"event\": {\"type\":","\"\"","","","","","","} } ] }","",""]
[null,null,null,null,null,null,null,null,null,"{","",", \"actions\": [{\"trigger\": {\"type\": \"timestamp\", \"data\": \"",0,"\"}, \"event\": {\"type\":","\"\"","","","","","","} } ] }","",""]
[null,null,null,null,null,null,null,null,null,"{","",", \"actions\": [{\"trigger\": {\"type\": \"timestamp\", \"data\": \"",0,"\"}, \"event\": {\"type\":","\"\"","","","","","","} } ] }","",""]
[null,null,null,null,null,null,null,null,null,"{","",", \"actions\": [{\"trigger\": {\"type\": \"timestamp\", \"data\": \"",0,"\"}, \"event\": {\"type\":","\"\"","","","","","","} } ] }","",""]
[null,null,null,null,null,null,null,null,null,"{","",", \"actions\": [{\"trigger\": {\"type\": \"timestamp\", \"data\": \"",0,"\"}, \"event\": {\"type\":","\"\"","","","","","","} } ] }","",""]
[null,null,null,null,null,null,null,null,null,"{","",", \"actions\": [{\"trigger\": {\"type\": \"timestamp\", \"data\": \"",0,"\"}, \"event\": {\"type\":","\"\"","","","","","","} } ] }","",""]
[null,null,null,null,null,null,null,null,null,"{","",", \"actions\": [{\"trigger\": {\"type\": \"timestamp\", \"data\": \"",0,"\"}, \"event\": {\"type\":","\"\"","","","","","","} } ] }","",""]
[null,null,null,null,null,null,null,null,null,"{","",", \"actions\": [{\"trigger\": {\"type\": \"timestamp\", \"data\": \"",0,"\"}, \"event\": {\"type\":","\"\"","","","","","","} } ] }","",""]
[null,null,null,null,null,null,null,null,null,"{","",", \"actions\": [{\"trigger\": {\"type\": \"timestamp\", \"data\": \"",0,"\"}, \"event\": {\"type\":","\"\"","","","","","","} } ] }","",""]
[null,null,null,null,null,null,null,null,null,"{","",", \"actions\": [{\"trigger\": {\"type\": \"timestamp\", \"data\": \"",0,"\"}, \"event\": {\"type\":","\"\"","","","","","","} } ] }","",""]
[null,null,null,null,null,null,null,null,null,"{","",", \"actions\": [{\"trigger\": {\"type\": \"timestamp\", \"data\": \"",0,"\"}, \"event\": {\"type\":","\"\"","","","","","","} } ] }","",""]
[null,null,null,null,null,null,null,null,null,"{","",", \"actions\": [{\"trigger\": {\"type\": \"timestamp\", \"data\": \"",0,"\"}, \"event\": {\"type\":","\"\"","","","","","","} } ] }","",""]
[null,null,null,null,null,null,null,null,null,"{","",", \"actions\": [{\"trigger\": {\"type\": \"timestamp\", \"data\": \"",0,"\"}, \"event\": {\"type\":","\"\"","","","","","","} } ] }","",""]
[null,null,null,null,null,null,null,null,null,"{","",", \"actions\": [{\"trigger\": {\"type\": \"timestamp\", \"data\": \"",0,"\"}, \"event\": {\"type\":","\"\"","","","","","","} } ] }","",""]
[null,null,null,null,null,null,null,null,null,"{","",", \"actions\": [{\"trigger\": {\"type\": \"timestamp\", \"data\": \"",0,"\"}, \"event\": {\"type\":","\"\"","","","","","","} } ] }","",""]
[null,null,null,null,null,null,null,null,null,"{","",", \"actions\": [{\"trigger\": {\"type\": \"timestamp\", \"data\": \"",0,"\"}, \"event\": {\"type\":","\"\"","","","","","","} } ] }","",""]
[null,null,null,null,null,null,null,null,null,"{","",", \"actions\": [{\"trigger\": {\"type\": \"timestamp\", \"data\": \"",0,"\"}, \"event\": {\"type\":","\"\"","","","","","","} } ] }","",""]
[null,null,null,null,null,null,null,null,null,"{","",", \"actions\": [{\"trigger\": {\"type\": \"timestamp\", \"data\": \"",0,"\"}, \"event\": {\"type\":","\"\"","","","","","","} } ] }","",""]
[null,null,null,null,null,null,null,null,null,"{","",", \"actions\": [{\"trigger\": {\"type\": \"timestamp\", \"data\": \"",0,"\"}, \"event\": {\"type\":","\"\"","","","","","","} } ] }","",""]
[null,null,null,null,null,null,null,null,null,"{","",", \"actions\": [{\"trigger\": {\"type\": \"timestamp\", \"data\": \"",0,"\"}, \"event\": {\"type\":","\"\"","","","","","","} } ] }","",""]
[null,null,null,null,null,null,null,null,null,"{","",", \"actions\": [{\"trigger\": {\"type\": \"timestamp\", \"data\": \"",0,"\"}, \"event\": {\"type\":","\"\"","","","","","","} } ] }","",""]
[null,null,null,null,null,null,null,null,null,"{","",", \"actions\": [{\"trigger\": {\"type\": \"timestamp\", \"data\": \"",0,"\"}, \"event\": {\"type\":","\"\"","","","","","","} } ] }","",""]
[null,null,null,null,null,null,null,null,null,"{","",", \"actions\": [{\"trigger\": {\"type\": \"timestamp\", \"data\": \"",0,"\"}, \"event\": {\"type\":","\"\"","","","","","","} } ] }","",""]
[null,null,null,null,null,null,null,null,null,"{","",", \"actions\": [{\"trigger\": {\"type\": \"timestamp\", \"data\": \"",0,"\"}, \"event\": {\"type\":","\"\"","","","","","","} } ] }","",""]
[null,null,null,null,null,null,null,null,null,"{","",", \"actions\": [{\"trigger\": {\"type\": \"timestamp\", \"data\": \"",0,"\"}, \"event\": {\"type\":","\"\"","","","","","","} } ] }","",""]
[null,null,null,null,null,null,null,null,null,"{","",", \"actions\": [{\"trigger\": {\"type\": \"timestamp\", \"data\": \"",0,"\"}, \"event\": {\"type\":","\"\"","","","","","","} } ] }","",""]
[null,null,null,null,null,null,null,null,null,"{","",", \"actions\": [{\"trigger\": {\"type\": \"timestamp\", \"data\": \"",0,"\"}, \"event\": {\"type\":","\"\"","","","","","","} } ] }","",""]
[null,null,null,null,null,null,null,null,null,"{","",", \"actions\": [{\"trigger\": {\"type\": \"timestamp\", \"data\": \"",0,"\"}, \"event\": {\"type\":","\"\"","","","","","","} } ] }","",""]
[null,null,null,null,null,null,null,null,null,"{",{"$f":"IF(A719<>\"\",CONCATENATE(\"\"\"\",A$3,\"\"\": \"\"\",$B$1,A719,\"\"\"\"),\"\")","v":""},", \"actions\": [{\"trigger\": {\"type\": \"timestamp\", \"data\": \"",{"$f":"B719*1000","v":0},"\"}, \"event\": {\"type\":",{"$f":"CONCATENATE(\"\"\"\",C719,\"\"\"\")","v":"\"\""},{"$f":"IF(D719<>\"\",CONCATENATE(\",\"\"\",D$3,\"\"\": \"\"\",D719,\"\"\"\"),\"\")","v":""},{"$f":"IF(E719<>\"\",CONCATENATE(\",\"\"\",E$3,\"\"\": \"\"\",E719,\"\"\"\"),\"\")","v":""},{"$f":"IF(F719<>\"\",CONCATENATE(\",\"\"\",F$3,\"\"\": \",F719),\"\")","v":""},{"$f":"IF(G719<>\"\",CONCATENATE(\",\"\"\",G$3,\"\"\": \",G719),\"\")","v":""},{"$f":"IF(H719<>\"\",CONCATENATE(\",\"\"\",H$3,\"\"\": \"\"\",H719,\"\"\"\"),\"\")","v":""},"} } ] }",{"$f":"IF(A719<>\"\",CONCATENATE(J719,K719,L719,M719,N719,O719,P719,Q719,R719,S719,T719,U719),\"\")","v":""},{"$f":"CONCATENATE(IF(AND(W718<>\"\",X718=\"\"),CONCATENATE(W718,IF(A719<>\"\",\",\",\"\")),\"\"),V719)","v":""}]
[null,null,null,null,null,null,null,null,null,"{","",", \"actions\": [{\"trigger\": {\"type\": \"timestamp\", \"data\": \"",0,"\"}, \"event\": {\"type\":","\"\"","","","","","","} } ] }","",""]
[null,null,null,null,null,null,null,null,null,"{","",", \"actions\": [{\"trigger\": {\"type\": \"timestamp\", \"data\": \"",0,"\"}, \"event\": {\"type\":","\"\"","","","","","","} } ] }","",""]
[null,null,null,null,null,null,null,null,null,"{","",", \"actions\": [{\"trigger\": {\"type\": \"timestamp\", \"data\": \"",0,"\"}, \"event\": {\"type\":","\"\"","","","","","","} } ] }","",""]
[null,null,null,null,null,null,null,null,null,"{","",", \"actions\": [{\"trigger\": {\"type\": \"timestamp\", \"data\": \"",0,"\"}, \"event\": {\"type\":","\"\"","","","","","","} } ] }","",""]
[null,null,null,null,null,null,null,null,null,"{","",", \"actions\": [{\"trigger\": {\"type\": \"timestamp\", \"data\": \"",0,"\"}, \"event\": {\"type\":","\"\"","","","","","","} } ] }","",""]
[null,null,null,null,null,null,null,null,null,"{","",", \"actions\": [{\"trigger\": {\"type\": \"timestamp\", \"data\": \"",0,"\"}, \"event\": {\"type\":","\"\"","","","","","","} } ] }","",""]
[null,null,null,null,null,null,null,null,null,"{","",", \"actions\": [{\"trigger\": {\"type\": \"timestamp\", \"data\": \"",0,"\"}, \"event\": {\"type\":","\"\"","","","","","","} } ] }","",""]
[null,null,null,null,null,null,null,null,null,"{","",", \"actions\": [{\"trigger\": {\"type\": \"timestamp\", \"data\": \"",0,"\"}, \"event\": {\"type\":","\"\"","","","","","","} } ] }","",""]
[null,null,null,null,null,null,null,null,null,"{","",", \"actions\": [{\"trigger\": {\"type\": \"timestamp\", \"data\": \"",0,"\"}, \"event\": {\"type\":","\"\"","","","","","","} } ] }","",""]
[null,null,null,null,null,null,null,null,null,"{","",", \"actions\": [{\"trigger\": {\"type\": \"timestamp\", \"data\": \"",0,"\"}, \"event\": {\"type\":","\"\"","","","","","","} } ] }","",""]
[null,null,null,null,null,null,null,null,null,"{","",", \"actions\": [{\"trigger\": {\"type\": \"timestamp\", \"data\": \"",0,"\"}, \"event\": {\"type\":","\"\"","","","","","","} } ] }","",""]
[null,null,null,null,null,null,null,null,null,"{","",", \"actions\": [{\"trigger\": {\"type\": \"timestamp\", \"data\": \"",0,"\"}, \"event\": {\"type\":","\"\"","","","","","","} } ] }","",""]
[null,null,null,null,null,null,null,null,null,"{","",", \"actions\": [{\"trigger\": {\"type\": \"timestamp\", \"data\": \"",0,"\"}, \"event\": {\"type\":","\"\"","","","","","","} } ] }","",""]
[null,null,null,null,null,null,null,null,null,"{","",", \"actions\": [{\"trigger\": {\"type\": \"timestamp\", \"data\": \"",0,"\"}, \"event\": {\"type\":","\"\"","","","","","","} } ] }","",""]
[null,null,null,null,null,null,null,null,null,"{","",", \"actions\": [{\"trigger\": {\"type\": \"timestamp\", \"data\": \"",0,"\"}, \"event\": {\"type\":","\"\"","","","","","","} } ] }","",""]
[null,null,null,null,null,null,null,null,null,"{","",", \"actions\": [{\"trigger\": {\"type\": \"timestamp\", \"data\": \"",0,"\"}, \"event\": {\"type\":","\"\"","","","","","","} } ] }","",""]
[null,null,null,null,null,null,null,null,null,"{","",", \"actions\": [{\"trigger\": {\"type\": \"timestamp\", \"data\": \"",0,"\"}, \"event\": {\"type\":","\"\"","","","","","","} } ] }","",""]
[null,null,null,null,null,null,null,null,null,"{","",", \"actions\": [{\"trigger\": {\"type\": \"timestamp\", \"data\": \"",0,"\"}, \"event\": {\"type\":","\"\"","","","","","","} } ] }","",""]
[null,null,null,null,null,null,null,null,null,"{","",", \"actions\": [{\"trigger\": {\"type\": \"timestamp\", \"data\": \"",0,"\"}, \"event\": {\"type\":","\"\"","","","","","","} } ] }","",""]
[null,null,null,null,null,null,null,null,null,"{","",", \"actions\": [{\"trigger\": {\"type\": \"timestamp\", \"data\": \"",0,"\"}, \"event\": {\"type\":","\"\"","","","","","","} } ] }","",""]
[null,null,null,null,null,null,null,null,null,"{","",", \"actions\": [{\"trigger\": {\"type\": \"timestamp\", \"data\": \"",0,"\"}, \"event\": {\"type\":","\"\"","","","","","","} } ] }","",""]
[null,null,null,null,null,null,null,null,null,"{","",", \"actions\": [{\"trigger\": {\"type\": \"timestamp\", \"data\": \"",0,"\"}, \"event\": {\"type\":","\"\"","","","","","","} } ] }","",""]
[null,null,null,null,null,null,null,null,null,"{","",", \"actions\": [{\"trigger\": {\"type\": \"timestamp\", \"data\": \"",0,"\"}, \"event\": {\"type\":","\"\"","","","","","","} } ] }","",""]
[null,null,null,null,null,null,null,null,null,"{","",", \"actions\": [{\"trigger\": {\"type\": \"timestamp\", \"data\": \"",0,"\"}, \"event\": {\"type\":","\"\"","","","","","","} } ] }","",""]
[null,null,null,null,null,null,null,null,null,"{","",", \"actions\": [{\"trigger\": {\"type\": \"timestamp\", \"data\": \"",0,"\"}, \"event\": {\"type\":","\"\"","","","","","","} } ] }","",""]
[null,null,null,null,null,null,null,null,null,"{","",", \"actions\": [{\"trigger\": {\"type\": \"timestamp\", \"data\": \"",0,"\"}, \"event\": {\"type\":","\"\"","","","","","","} } ] }","",""]
[null,null,null,null,null,null,null,null,null,"{","",", \"actions\": [{\"trigger\": {\"type\": \"timestamp\", \"data\": \"",0,"\"}, \"event\": {\"type\":","\"\"","","","","","","} } ] }","",""]
[null,null,null,null,null,null,null,null,null,"{","",", \"actions\": [{\"trigger\": {\"type\": \"timestamp\", \"data\": \"",0,"\"}, \"event\": {\"type\":","\"\"","","","","","","} } ] }","",""]
[null,null,null,null,null,null,null,null,null,"{","",", \"actions\": [{\"trigger\": {\"type\": \"timestamp\", \"data\": \"",0,"\"}, \"event\": {\"type\":","\"\"","","","","","","} } ] }","",""]
[null,null,null,null,null,null,null,null,null,"{","",", \"actions\": [{\"trigger\": {\"type\": \"timestamp\", \"data\": \"",0,"\"}, \"event\": {\"type\":","\"\"","","","","","","} } ] }","",""]
[null,null,null,null,null,null,null,null,null,"{","",", \"actions\": [{\"trigger\": {\"type\": \"timestamp\", \"data\": \"",0,"\"}, \"event\": {\"type\":","\"\"","","","","","","} } ] }","",""]
[null,null,null,null,null,null,null,null,null,"{","",", \"actions\": [{\"trigger\": {\"type\": \"timestamp\", \"data\": \"",0,"\"}, \"event\": {\"type\":","\"\"","","","","","","} } ] }","",""]
[null,null,null,null,null,null,null,null,null,"{","",", \"actions\": [{\"trigger\": {\"type\": \"timestamp\", \"data\": \"",0,"\"}, \"event\": {\"type\":","\"\"","","","","","","} } ] }","",""]
[null,null,null,null,null,null,null,null,null,"{","",", \"actions\": [{\"trigger\": {\"type\": \"timestamp\", \"data\": \"",0,"\"}, \"event\": {\"type\":","\"\"","","","","","","} } ] }","",""]
[null,null,null,null,null,null,null,null,null,"{","",", \"actions\": [{\"trigger\": {\"type\": \"timestamp\", \"data\": \"",0,"\"}, \"event\": {\"type\":","\"\"","","","","","","} } ] }","",""]
[null,null,null,null,null,null,null,null,null,"{","",", \"actions\": [{\"trigger\": {\"type\": \"timestamp\", \"data\": \"",0,"\"}, \"event\": {\"type\":","\"\"","","","","","","} } ] }","",""]
[null,null,null,null,null,null,null,null,null,"{","",", \"actions\": [{\"trigger\": {\"type\": \"timestamp\", \"data\": \"",0,"\"}, \"event\": {\"type\":","\"\"","","","","","","} } ] }","",""]
[null,null,null,null,null,null,null,null,null,"{","",", \"actions\": [{\"trigger\": {\"type\": \"timestamp\", \"data\": \"",0,"\"}, \"event\": {\"type\":","\"\"","","","","","","} } ] }","",""]
[null,null,null,null,null,null,null,null,null,"{","",", \"actions\": [{\"trigger\": {\"type\": \"timestamp\", \"data\": \"",0,"\"}, \"event\": {\"type\":","\"\"","","","","","","} } ] }","",""]
[null,null,null,null,null,null,null,null,null,"{","",", \"actions\": [{\"trigger\": {\"type\": \"timestamp\", \"data\": \"",0,"\"}, \"event\": {\"type\":","\"\"","","","","","","} } ] }","",""]
[null,null,null,null,null,null,null,null,null,"{","",", \"actions\": [{\"trigger\": {\"type\": \"timestamp\", \"data\": \"",0,"\"}, \"event\": {\"type\":","\"\"","","","","","","} } ] }","",""]
[null,null,null,null,null,null,null,null,null,"{","",", \"actions\": [{\"trigger\": {\"type\": \"timestamp\", \"data\": \"",0,"\"}, \"event\": {\"type\":","\"\"","","","","","","} } ] }","",""]
[null,null,null,null,null,null,null,null,null,"{","",", \"actions\": [{\"trigger\": {\"type\": \"timestamp\", \"data\": \"",0,"\"}, \"event\": {\"type\":","\"\"","","","","","","} } ] }","",""]
[null,null,null,null,null,null,null,null,null,"{","",", \"actions\": [{\"trigger\": {\"type\": \"timestamp\", \"data\": \"",0,"\"}, \"event\": {\"type\":","\"\"","","","","","","} } ] }","",""]
[null,null,null,null,null,null,null,null,null,"{","",", \"actions\": [{\"trigger\": {\"type\": \"timestamp\", \"data\": \"",0,"\"}, \"event\": {\"type\":","\"\"","","","","","","} } ] }","",""]
[null,null,null,null,null,null,null,null,null,"{","",", \"actions\": [{\"trigger\": {\"type\": \"timestamp\", \"data\": \"",0,"\"}, \"event\": {\"type\":","\"\"","","","","","","} } ] }","",""]
[null,null,null,null,null,null,null,null,null,"{","",", \"actions\": [{\"trigger\": {\"type\": \"timestamp\", \"data\": \"",0,"\"}, \"event\": {\"type\":","\"\"","","","","","","} } ] }","",""]
[null,null,null,null,null,null,null,null,null,"{","",", \"actions\": [{\"trigger\": {\"type\": \"timestamp\", \"data\": \"",0,"\"}, \"event\": {\"type\":","\"\"","","","","","","} } ] }","",""]
[null,null,null,null,null,null,null,null,null,"{","",", \"actions\": [{\"trigger\": {\"type\": \"timestamp\", \"data\": \"",0,"\"}, \"event\": {\"type\":","\"\"","","","","","","} } ] }","",""]
[null,null,null,null,null,null,null,null,null,"{","",", \"actions\": [{\"trigger\": {\"type\": \"timestamp\", \"data\": \"",0,"\"}, \"event\": {\"type\":","\"\"","","","","","","} } ] }","",""]
[null,null,null,null,null,null,null,null,null,"{","",", \"actions\": [{\"trigger\": {\"type\": \"timestamp\", \"data\": \"",0,"\"}, \"event\": {\"type\":","\"\"","","","","","","} } ] }","",""]
[null,null,null,null,null,null,null,null,null,"{","",", \"actions\": [{\"trigger\": {\"type\": \"timestamp\", \"data\": \"",0,"\"}, \"event\": {\"type\":","\"\"","","","","","","} } ] }","",""]
[null,null,null,null,null,null,null,null,null,"{","",", \"actions\": [{\"trigger\": {\"type\": \"timestamp\", \"data\": \"",0,"\"}, \"event\": {\"type\":","\"\"","","","","","","} } ] }","",""]
[null,null,null,null,null,null,null,null,null,"{","",", \"actions\": [{\"trigger\": {\"type\": \"timestamp\", \"data\": \"",0,"\"}, \"event\": {\"type\":","\"\"","","","","","","} } ] }","",""]
[null,null,null,null,null,null,null,null,null,"{","",", \"actions\": [{\"trigger\": {\"type\": \"timestamp\", \"data\": \"",0,"\"}, \"event\": {\"type\":","\"\"","","","","","","} } ] }","",""]
[null,null,null,null,null,null,null,null,null,"{","",", \"actions\": [{\"trigger\": {\"type\": \"timestamp\", \"data\": \"",0,"\"}, \"event\": {\"type\":","\"\"","","","","","","} } ] }","",""]
[null,null,null,null,null,null,null,null,null,"{","",", \"actions\": [{\"trigger\": {\"type\": \"timestamp\", \"data\": \"",0,"\"}, \"event\": {\"type\":","\"\"","","","","","","} } ] }","",""]
[null,null,null,null,null,null,null,null,null,"{","",", \"actions\": [{\"trigger\": {\"type\": \"timestamp\", \"data\": \"",0,"\"}, \"event\": {\"type\":","\"\"","","","","","","} } ] }","",""]
[null,null,null,null,null,null,null,null,null,"{","",", \"actions\": [{\"trigger\": {\"type\": \"timestamp\", \"data\": \"",0,"\"}, \"event\": {\"type\":","\"\"","","","","","","} } ] }","",""]
[null,null,null,null,null,null,null,null,null,"{","",", \"actions\": [{\"trigger\": {\"type\": \"timestamp\", \"data\": \"",0,"\"}, \"event\": {\"type\":","\"\"","","","","","","} } ] }","",""]
[null,null,null,null,null,null,null,null,null,"{","",", \"actions\": [{\"trigger\": {\"type\": \"timestamp\", \"data\": \"",0,"\"}, \"event\": {\"type\":","\"\"","","","","","","} } ] }","",""]
[null,null,null,null,null,null,null,null,null,"{","",", \"actions\": [{\"trigger\": {\"type\": \"timestamp\", \"data\": \"",0,"\"}, \"event\": {\"type\":","\"\"","","","","","","} } ] }","",""]
[null,null,null,null,null,null,null,null,null,"{","",", \"actions\": [{\"trigger\": {\"type\": \"timestamp\", \"data\": \"",0,"\"}, \"event\": {\"type\":","\"\"","","","","","","} } ] }","",""]
[null,null,null,null,null,null,null,null,null,"{",{"$f":"IF(A783<>\"\",CONCATENATE(\"\"\"\",A$3,\"\"\": \"\"\",$B$1,A783,\"\"\"\"),\"\")","v":""},", \"actions\": [{\"trigger\": {\"type\": \"timestamp\", \"data\": \"",{"$f":"B783*1000","v":0},"\"}, \"event\": {\"type\":",{"$f":"CONCATENATE(\"\"\"\",C783,\"\"\"\")","v":"\"\""},{"$f":"IF(D783<>\"\",CONCATENATE(\",\"\"\",D$3,\"\"\": \"\"\",D783,\"\"\"\"),\"\")","v":""},{"$f":"IF(E783<>\"\",CONCATENATE(\",\"\"\",E$3,\"\"\": \"\"\",E783,\"\"\"\"),\"\")","v":""},{"$f":"IF(F783<>\"\",CONCATENATE(\",\"\"\",F$3,\"\"\": \",F783),\"\")","v":""},{"$f":"IF(G783<>\"\",CONCATENATE(\",\"\"\",G$3,\"\"\": \",G783),\"\")","v":""},{"$f":"IF(H783<>\"\",CONCATENATE(\",\"\"\",H$3,\"\"\": \"\"\",H783,\"\"\"\"),\"\")","v":""},"} } ] }",{"$f":"IF(A783<>\"\",CONCATENATE(J783,K783,L783,M783,N783,O783,P783,Q783,R783,S783,T783,U783),\"\")","v":""},{"$f":"CONCATENATE(IF(AND(W782<>\"\",X782=\"\"),CONCATENATE(W782,IF(A783<>\"\",\",\",\"\")),\"\"),V783)","v":""}]
[null,null,null,null,null,null,null,null,null,"{","",", \"actions\": [{\"trigger\": {\"type\": \"timestamp\", \"data\": \"",0,"\"}, \"event\": {\"type\":","\"\"","","","","","","} } ] }","",""]
[null,null,null,null,null,null,null,null,null,"{","",", \"actions\": [{\"trigger\": {\"type\": \"timestamp\", \"data\": \"",0,"\"}, \"event\": {\"type\":","\"\"","","","","","","} } ] }","",""]
[null,null,null,null,null,null,null,null,null,"{","",", \"actions\": [{\"trigger\": {\"type\": \"timestamp\", \"data\": \"",0,"\"}, \"event\": {\"type\":","\"\"","","","","","","} } ] }","",""]
[null,null,null,null,null,null,null,null,null,"{","",", \"actions\": [{\"trigger\": {\"type\": \"timestamp\", \"data\": \"",0,"\"}, \"event\": {\"type\":","\"\"","","","","","","} } ] }","",""]
[null,null,null,null,null,null,null,null,null,"{","",", \"actions\": [{\"trigger\": {\"type\": \"timestamp\", \"data\": \"",0,"\"}, \"event\": {\"type\":","\"\"","","","","","","} } ] }","",""]
[null,null,null,null,null,null,null,null,null,"{","",", \"actions\": [{\"trigger\": {\"type\": \"timestamp\", \"data\": \"",0,"\"}, \"event\": {\"type\":","\"\"","","","","","","} } ] }","",""]
[null,null,null,null,null,null,null,null,null,"{","",", \"actions\": [{\"trigger\": {\"type\": \"timestamp\", \"data\": \"",0,"\"}, \"event\": {\"type\":","\"\"","","","","","","} } ] }","",""]
[null,null,null,null,null,null,null,null,null,"{","",", \"actions\": [{\"trigger\": {\"type\": \"timestamp\", \"data\": \"",0,"\"}, \"event\": {\"type\":","\"\"","","","","","","} } ] }","",""]
[null,null,null,null,null,null,null,null,null,"{","",", \"actions\": [{\"trigger\": {\"type\": \"timestamp\", \"data\": \"",0,"\"}, \"event\": {\"type\":","\"\"","","","","","","} } ] }","",""]
[null,null,null,null,null,null,null,null,null,"{","",", \"actions\": [{\"trigger\": {\"type\": \"timestamp\", \"data\": \"",0,"\"}, \"event\": {\"type\":","\"\"","","","","","","} } ] }","",""]
[null,null,null,null,null,null,null,null,null,"{","",", \"actions\": [{\"trigger\": {\"type\": \"timestamp\", \"data\": \"",0,"\"}, \"event\": {\"type\":","\"\"","","","","","","} } ] }","",""]
[null,null,null,null,null,null,null,null,null,"{","",", \"actions\": [{\"trigger\": {\"type\": \"timestamp\", \"data\": \"",0,"\"}, \"event\": {\"type\":","\"\"","","","","","","} } ] }","",""]
[null,null,null,null,null,null,null,null,null,"{","",", \"actions\": [{\"trigger\": {\"type\": \"timestamp\", \"data\": \"",0,"\"}, \"event\": {\"type\":","\"\"","","","","","","} } ] }","",""]
[null,null,null,null,null,null,null,null,null,"{","",", \"actions\": [{\"trigger\": {\"type\": \"timestamp\", \"data\": \"",0,"\"}, \"event\": {\"type\":","\"\"","","","","","","} } ] }","",""]
[null,null,null,null,null,null,null,null,null,"{","",", \"actions\": [{\"trigger\": {\"type\": \"timestamp\", \"data\": \"",0,"\"}, \"event\": {\"type\":","\"\"","","","","","","} } ] }","",""]
[null,null,null,null,null,null,null,null,null,"{","",", \"actions\": [{\"trigger\": {\"type\": \"timestamp\", \"data\": \"",0,"\"}, \"event\": {\"type\":","\"\"","","","","","","} } ] }","",""]
[null,null,null,null,null,null,null,null,null,"{","",", \"actions\": [{\"trigger\": {\"type\": \"timestamp\", \"data\": \"",0,"\"}, \"event\": {\"type\":","\"\"","","","","","","} } ] }","",""]
[null,null,null,null,null,null,null,null,null,"{","",", \"actions\": [{\"trigger\": {\"type\": \"timestamp\", \"data\": \"",0,"\"}, \"event\": {\"type\":","\"\"","","","","","","} } ] }","",""]
[null,null,null,null,null,null,null,null,null,"{","",", \"actions\": [{\"trigger\": {\"type\": \"timestamp\", \"data\": \"",0,"\"}, \"event\": {\"type\":","\"\"","","","","","","} } ] }","",""]
[null,null,null,null,null,null,null,null,null,"{","",", \"actions\": [{\"trigger\": {\"type\": \"timestamp\", \"data\": \"",0,"\"}, \"event\": {\"type\":","\"\"","","","","","","} } ] }","",""]
[null,null,null,null,null,null,null,null,null,"{","",", \"actions\": [{\"trigger\": {\"type\": \"timestamp\", \"data\": \"",0,"\"}, \"event\": {\"type\":","\"\"","","","","","","} } ] }","",""]
[null,null,null,null,null,null,null,null,null,"{","",", \"actions\": [{\"trigger\": {\"type\": \"timestamp\", \"data\": \"",0,"\"}, \"event\": {\"type\":","\"\"","","","","","","} } ] }","",""]
[null,null,null,null,null,null,null,null,null,"{","",", \"actions\": [{\"trigger\": {\"type\": \"timestamp\", \"data\": \"",0,"\"}, \"event\": {\"type\":","\"\"","","","","","","} } ] }","",""]
[null,null,null,null,null,null,null,null,null,"{","",", \"actions\": [{\"trigger\": {\"type\": \"timestamp\", \"data\": \"",0,"\"}, \"event\": {\"type\":","\"\"","","","","","","} } ] }","",""]
[null,null,null,null,null,null,null,null,null,"{","",", \"actions\": [{\"trigger\": {\"type\": \"timestamp\", \"data\": \"",0,"\"}, \"event\": {\"type\":","\"\"","","","","","","} } ] }","","",4]
[null,null,null,null,null,null,null,null,null,"{","",", \"actions\": [{\"trigger\": {\"type\": \"timestamp\", \"data\": \"",0,"\"}, \"event\": {\"type\":","\"\"","","","","","","} } ] }","",""]
[null,null,null,null,null,null,null,null,null,"{","",", \"actions\": [{\"trigger\": {\"type\": \"timestamp\", \"data\": \"",0,"\"}, \"event\": {\"type\":","\"\"","","","","","","} } ] }","",""]
[null,null,null,null,null,null,null,null,null,"{","",", \"actions\": [{\"trigger\": {\"type\": \"timestamp\", \"data\": \"",0,"\"}, \"event\": {\"type\":","\"\"","","","","","","} } ] }","",""]
[null,null,null,null,null,null,null,null,null,"{","",", \"actions\": [{\"trigger\": {\"type\": \"timestamp\", \"data\": \"",0,"\"}, \"event\": {\"type\":","\"\"","","","","","","} } ] }","",""]
[null,null,null,null,null,null,null,null,null,"{","",", \"actions\": [{\"trigger\": {\"type\": \"timestamp\", \"data\": \"",0,"\"}, \"event\": {\"type\":","\"\"","","","","","","} } ] }","",""]
[null,null,null,null,null,null,null,null,null,"{","",", \"actions\": [{\"trigger\": {\"type\": \"timestamp\", \"data\": \"",0,"\"}, \"event\": {\"type\":","\"\"","","","","","","} } ] }","",""]
[null,null,null,null,null,null,null,null,null,"{","",", \"actions\": [{\"trigger\": {\"type\": \"timestamp\", \"data\": \"",0,"\"}, \"event\": {\"type\":","\"\"","","","","","","} } ] }","",""]
[null,null,null,null,null,null,null,null,null,"{","",", \"actions\": [{\"trigger\": {\"type\": \"timestamp\", \"data\": \"",0,"\"}, \"event\": {\"type\":","\"\"","","","","","","} } ] }","",""]
[null,null,null,null,null,null,null,null,null,"{","",", \"actions\": [{\"trigger\": {\"type\": \"timestamp\", \"data\": \"",0,"\"}, \"event\": {\"type\":","\"\"","","","","","","} } ] }","",""]
[null,null,null,null,null,null,null,null,null,"{","",", \"actions\": [{\"trigger\": {\"type\": \"timestamp\", \"data\": \"",0,"\"}, \"event\": {\"type\":","\"\"","","","","","","} } ] }","",""]
[null,null,null,null,null,null,null,null,null,"{","",", \"actions\": [{\"trigger\": {\"type\": \"timestamp\", \"data\": \"",0,"\"}, \"event\": {\"type\":","\"\"","","","","","","} } ] }","",""]
[null,null,null,null,null,null,null,null,null,"{","",", \"actions\": [{\"trigger\": {\"type\": \"timestamp\", \"data\": \"",0,"\"}, \"event\": {\"type\":","\"\"","","","","","","} } ] }","",""]
[null,null,null,null,null,null,null,null,null,"{","",", \"actions\": [{\"trigger\": {\"type\": \"timestamp\", \"data\": \"",0,"\"}, \"event\": {\"type\":","\"\"","","","","","","} } ] }","",""]
[null,null,null,null,null,null,null,null,null,"{","",", \"actions\": [{\"trigger\": {\"type\": \"timestamp\", \"data\": \"",0,"\"}, \"event\": {\"type\":","\"\"","","","","","","} } ] }","",""]
[null,null,null,null,null,null,null,null,null,"{","",", \"actions\": [{\"trigger\": {\"type\": \"timestamp\", \"data\": \"",0,"\"}, \"event\": {\"type\":","\"\"","","","","","","} } ] }","",""]
[null,null,null,null,null,null,null,null,null,"{","",", \"actions\": [{\"trigger\": {\"type\": \"timestamp\", \"data\": \"",0,"\"}, \"event\": {\"type\":","\"\"","","","","","","} } ] }","",""]
[null,null,null,null,null,null,null,null,null,"{","",", \"actions\": [{\"trigger\": {\"type\": \"timestamp\", \"data\": \"",0,"\"}, \"event\": {\"type\":","\"\"","","","","","","} } ] }","",""]
[null,null,null,null,null,null,null,null,null,"{","",", \"actions\": [{\"trigger\": {\"type\": \"timestamp\", \"data\": \"",0,"\"}, \"event\": {\"type\":","\"\"","","","","","","} } ] }","",""]
[null,null,null,null,null,null,null,null,null,"{","",", \"actions\": [{\"trigger\": {\"type\": \"timestamp\", \"data\": \"",0,"\"}, \"event\": {\"type\":","\"\"","","","","","","} } ] }","",""]
[null,null,null,null,null,null,null,null,null,"{","",", \"actions\": [{\"trigger\": {\"type\": \"timestamp\", \"data\": \"",0,"\"}, \"event\": {\"type\":","\"\"","","","","","","} } ] }","",""]
[null,null,null,null,null,null,null,null,null,"{","",", \"actions\": [{\"trigger\": {\"type\": \"timestamp\", \"data\": \"",0,"\"}, \"event\": {\"type\":","\"\"","","","","","","} } ] }","",""]
[null,null,null,null,null,null,null,null,null,"{","",", \"actions\": [{\"trigger\": {\"type\": \"timestamp\", \"data\": \"",0,"\"}, \"event\": {\"type\":","\"\"","","","","","","} } ] }","",""]
[null,null,null,null,null,null,null,null,null,"{","",", \"actions\": [{\"trigger\": {\"type\": \"timestamp\", \"data\": \"",0,"\"}, \"event\": {\"type\":","\"\"","","","","","","} } ] }","",""]
[null,null,null,null,null,null,null,null,null,"{","",", \"actions\": [{\"trigger\": {\"type\": \"timestamp\", \"data\": \"",0,"\"}, \"event\": {\"type\":","\"\"","","","","","","} } ] }","",""]
[null,null,null,null,null,null,null,null,null,"{","",", \"actions\": [{\"trigger\": {\"type\": \"timestamp\", \"data\": \"",0,"\"}, \"event\": {\"type\":","\"\"","","","","","","} } ] }","",""]
[null,null,null,null,null,null,null,null,null,"{","",", \"actions\": [{\"trigger\": {\"type\": \"timestamp\", \"data\": \"",0,"\"}, \"event\": {\"type\":","\"\"","","","","","","} } ] }","",""]
[null,null,null,null,null,null,null,null,null,"{","",", \"actions\": [{\"trigger\": {\"type\": \"timestamp\", \"data\": \"",0,"\"}, \"event\": {\"type\":","\"\"","","","","","","} } ] }","",""]
[null,null,null,null,null,null,null,null,null,"{","",", \"actions\": [{\"trigger\": {\"type\": \"timestamp\", \"data\": \"",0,"\"}, \"event\": {\"type\":","\"\"","","","","","","} } ] }","",""]
[null,null,null,null,null,null,null,null,null,"{","",", \"actions\": [{\"trigger\": {\"type\": \"timestamp\", \"data\": \"",0,"\"}, \"event\": {\"type\":","\"\"","","","","","","} } ] }","",""]
[null,null,null,null,null,null,null,null,null,"{","",", \"actions\": [{\"trigger\": {\"type\": \"timestamp\", \"data\": \"",0,"\"}, \"event\": {\"type\":","\"\"","","","","","","} } ] }","",""]
[null,null,null,null,null,null,null,null,null,"{","",", \"actions\": [{\"trigger\": {\"type\": \"timestamp\", \"data\": \"",0,"\"}, \"event\": {\"type\":","\"\"","","","","","","} } ] }","",""]
[null,null,null,null,null,null,null,null,null,"{","",", \"actions\": [{\"trigger\": {\"type\": \"timestamp\", \"data\": \"",0,"\"}, \"event\": {\"type\":","\"\"","","","","","","} } ] }","",""]
[null,null,null,null,null,null,null,null,null,"{","",", \"actions\": [{\"trigger\": {\"type\": \"timestamp\", \"data\": \"",0,"\"}, \"event\": {\"type\":","\"\"","","","","","","} } ] }","",""]
[null,null,null,null,null,null,null,null,null,"{","",", \"actions\": [{\"trigger\": {\"type\": \"timestamp\", \"data\": \"",0,"\"}, \"event\": {\"type\":","\"\"","","","","","","} } ] }","",""]
[null,null,null,null,null,null,null,null,null,"{","",", \"actions\": [{\"trigger\": {\"type\": \"timestamp\", \"data\": \"",0,"\"}, \"event\": {\"type\":","\"\"","","","","","","} } ] }","",""]
[null,null,null,null,null,null,null,null,null,"{","",", \"actions\": [{\"trigger\": {\"type\": \"timestamp\", \"data\": \"",0,"\"}, \"event\": {\"type\":","\"\"","","","","","","} } ] }","",""]
[null,null,null,null,null,null,null,null,null,"{","",", \"actions\": [{\"trigger\": {\"type\": \"timestamp\", \"data\": \"",0,"\"}, \"event\": {\"type\":","\"\"","","","","","","} } ] }","",""]
[null,null,null,null,null,null,null,null,null,"{","",", \"actions\": [{\"trigger\": {\"type\": \"timestamp\", \"data\": \"",0,"\"}, \"event\": {\"type\":","\"\"","","","","","","} } ] }","",""]
[null,null,null,null,null,null,null,null,null,"{",{"$f":"IF(A847<>\"\",CONCATENATE(\"\"\"\",A$3,\"\"\": \"\"\",$B$1,A847,\"\"\"\"),\"\")","v":""},", \"actions\": [{\"trigger\": {\"type\": \"timestamp\", \"data\": \"",{"$f":"B847*1000","v":0},"\"}, \"event\": {\"type\":",{"$f":"CONCATENATE(\"\"\"\",C847,\"\"\"\")","v":"\"\""},{"$f":"IF(D847<>\"\",CONCATENATE(\",\"\"\",D$3,\"\"\": \"\"\",D847,\"\"\"\"),\"\")","v":""},{"$f":"IF(E847<>\"\",CONCATENATE(\",\"\"\",E$3,\"\"\": \"\"\",E847,\"\"\"\"),\"\")","v":""},{"$f":"IF(F847<>\"\",CONCATENATE(\",\"\"\",F$3,\"\"\": \",F847),\"\")","v":""},{"$f":"IF(G847<>\"\",CONCATENATE(\",\"\"\",G$3,\"\"\": \",G847),\"\")","v":""},{"$f":"IF(H847<>\"\",CONCATENATE(\",\"\"\",H$3,\"\"\": \"\"\",H847,\"\"\"\"),\"\")","v":""},"} } ] }",{"$f":"IF(A847<>\"\",CONCATENATE(J847,K847,L847,M847,N847,O847,P847,Q847,R847,S847,T847,U847),\"\")","v":""},{"$f":"CONCATENATE(IF(AND(W846<>\"\",X846=\"\"),CONCATENATE(W846,IF(A847<>\"\",\",\",\"\")),\"\"),V847)","v":""}]
[null,null,null,null,null,null,null,null,null,"{","",", \"actions\": [{\"trigger\": {\"type\": \"timestamp\", \"data\": \"",0,"\"}, \"event\": {\"type\":","\"\"","","","","","","} } ] }","",""]
[null,null,null,null,null,null,null,null,null,"{","",", \"actions\": [{\"trigger\": {\"type\": \"timestamp\", \"data\": \"",0,"\"}, \"event\": {\"type\":","\"\"","","","","","","} } ] }","",""]
[null,null,null,null,null,null,null,null,null,"{","",", \"actions\": [{\"trigger\": {\"type\": \"timestamp\", \"data\": \"",0,"\"}, \"event\": {\"type\":","\"\"","","","","","","} } ] }","",""]
[null,null,null,null,null,null,null,null,null,"{","",", \"actions\": [{\"trigger\": {\"type\": \"timestamp\", \"data\": \"",0,"\"}, \"event\": {\"type\":","\"\"","","","","","","} } ] }","",""]
[null,null,null,null,null,null,null,null,null,"{","",", \"actions\": [{\"trigger\": {\"type\": \"timestamp\", \"data\": \"",0,"\"}, \"event\": {\"type\":","\"\"","","","","","","} } ] }","",""]
[null,null,null,null,null,null,null,null,null,"{","",", \"actions\": [{\"trigger\": {\"type\": \"timestamp\", \"data\": \"",0,"\"}, \"event\": {\"type\":","\"\"","","","","","","} } ] }","",""]
[null,null,null,null,null,null,null,null,null,"{","",", \"actions\": [{\"trigger\": {\"type\": \"timestamp\", \"data\": \"",0,"\"}, \"event\": {\"type\":","\"\"","","","","","","} } ] }","",""]
[null,null,null,null,null,null,null,null,null,"{","",", \"actions\": [{\"trigger\": {\"type\": \"timestamp\", \"data\": \"",0,"\"}, \"event\": {\"type\":","\"\"","","","","","","} } ] }","",""]
[null,null,null,null,null,null,null,null,null,"{","",", \"actions\": [{\"trigger\": {\"type\": \"timestamp\", \"data\": \"",0,"\"}, \"event\": {\"type\":","\"\"","","","","","","} } ] }","",""]
[null,null,null,null,null,null,null,null,null,"{","",", \"actions\": [{\"trigger\": {\"type\": \"timestamp\", \"data\": \"",0,"\"}, \"event\": {\"type\":","\"\"","","","","","","} } ] }","",""]
[null,null,null,null,null,null,null,null,null,"{","",", \"actions\": [{\"trigger\": {\"type\": \"timestamp\", \"data\": \"",0,"\"}, \"event\": {\"type\":","\"\"","","","","","","} } ] }","",""]
[null,null,null,null,null,null,null,null,null,"{","",", \"actions\": [{\"trigger\": {\"type\": \"timestamp\", \"data\": \"",0,"\"}, \"event\": {\"type\":","\"\"","","","","","","} } ] }","",""]
[null,null,null,null,null,null,null,null,null,"{","",", \"actions\": [{\"trigger\": {\"type\": \"timestamp\", \"data\": \"",0,"\"}, \"event\": {\"type\":","\"\"","","","","","","} } ] }","",""]
[null,null,null,null,null,null,null,null,null,"{","",", \"actions\": [{\"trigger\": {\"type\": \"timestamp\", \"data\": \"",0,"\"}, \"event\": {\"type\":","\"\"","","","","","","} } ] }","",""]
[null,null,null,null,null,null,null,null,null,"{","",", \"actions\": [{\"trigger\": {\"type\": \"timestamp\", \"data\": \"",0,"\"}, \"event\": {\"type\":","\"\"","","","","","","} } ] }","",""]
[null,null,null,null,null,null,null,null,null,"{","",", \"actions\": [{\"trigger\": {\"type\": \"timestamp\", \"data\": \"",0,"\"}, \"event\": {\"type\":","\"\"","","","","","","} } ] }","",""]
[null,null,null,null,null,null,null,null,null,"{","",", \"actions\": [{\"trigger\": {\"type\": \"timestamp\", \"data\": \"",0,"\"}, \"event\": {\"type\":","\"\"","","","","","","} } ] }","",""]
[null,null,null,null,null,null,null,null,null,"{","",", \"actions\": [{\"trigger\": {\"type\": \"timestamp\", \"data\": \"",0,"\"}, \"event\": {\"type\":","\"\"","","","","","","} } ] }","",""]
[null,null,null,null,null,null,null,null,null,"{","",", \"actions\": [{\"trigger\": {\"type\": \"timestamp\", \"data\": \"",0,"\"}, \"event\": {\"type\":","\"\"","","","","","","} } ] }","",""]
[null,null,null,null,null,null,null,null,null,"{","",", \"actions\": [{\"trigger\": {\"type\": \"timestamp\", \"data\": \"",0,"\"}, \"event\": {\"type\":","\"\"","","","","","","} } ] }","",""]
[null,null,null,null,null,null,null,null,null,"{","",", \"actions\": [{\"trigger\": {\"type\": \"timestamp\", \"data\": \"",0,"\"}, \"event\": {\"type\":","\"\"","","","","","","} } ] }","",""]
[null,null,null,null,null,null,null,null,null,"{","",", \"actions\": [{\"trigger\": {\"type\": \"timestamp\", \"data\": \"",0,"\"}, \"event\": {\"type\":","\"\"","","","","","","} } ] }","",""]
[null,null,null,null,null,null,null,null,null,"{","",", \"actions\": [{\"trigger\": {\"type\": \"timestamp\", \"data\": \"",0,"\"}, \"event\": {\"type\":","\"\"","","","","","","} } ] }","",""]
[null,null,null,null,null,null,null,null,null,"{","",", \"actions\": [{\"trigger\": {\"type\": \"timestamp\", \"data\": \"",0,"\"}, \"event\": {\"type\":","\"\"","","","","","","} } ] }","",""]
[null,null,null,null,null,null,null,null,null,"{","",", \"actions\": [{\"trigger\": {\"type\": \"timestamp\", \"data\": \"",0,"\"}, \"event\": {\"type\":","\"\"","","","","","","} } ] }","",""]
[null,null,null,null,null,null,null,null,null,"{","",", \"actions\": [{\"trigger\": {\"type\": \"timestamp\", \"data\": \"",0,"\"}, \"event\": {\"type\":","\"\"","","","","","","} } ] }","",""]
[null,null,null,null,null,null,null,null,null,"{","",", \"actions\": [{\"trigger\": {\"type\": \"timestamp\", \"data\": \"",0,"\"}, \"event\": {\"type\":","\"\"","","","","","","} } ] }","",""]
[null,null,null,null,null,null,null,null,null,"{","",", \"actions\": [{\"trigger\": {\"type\": \"timestamp\", \"data\": \"",0,"\"}, \"event\": {\"type\":","\"\"","","","","","","} } ] }","",""]
[null,null,null,null,null,null,null,null,null,"{","",", \"actions\": [{\"trigger\": {\"type\": \"timestamp\", \"data\": \"",0,"\"}, \"event\": {\"type\":","\"\"","","","","","","} } ] }","",""]
[null,null,null,null,null,null,null,null,null,"{","",", \"actions\": [{\"trigger\": {\"type\": \"timestamp\", \"data\": \"",0,"\"}, \"event\": {\"type\":","\"\"","","","","","","} } ] }","",""]
[null,null,null,null,null,null,null,null,null,"{","",", \"actions\": [{\"trigger\": {\"type\": \"timestamp\", \"data\": \"",0,"\"}, \"event\": {\"type\":","\"\"","","","","","","} } ] }","",""]
[null,null,null,null,null,null,null,null,null,"{","",", \"actions\": [{\"trigger\": {\"type\": \"timestamp\", \"data\": \"",0,"\"}, \"event\": {\"type\":","\"\"","","","","","","} } ] }","",""]
[null,null,null,null,null,null,null,null,null,"{","",", \"actions\": [{\"trigger\": {\"type\": \"timestamp\", \"data\": \"",0,"\"}, \"event\": {\"type\":","\"\"","","","","","","} } ] }","",""]
[null,null,null,null,null,null,null,null,null,"{","",", \"actions\": [{\"trigger\": {\"type\": \"timestamp\", \"data\": \"",0,"\"}, \"event\": {\"type\":","\"\"","","","","","","} } ] }","",""]
[null,null,null,null,null,null,null,null,null,"{","",", \"actions\": [{\"trigger\": {\"type\": \"timestamp\", \"data\": \"",0,"\"}, \"event\": {\"type\":","\"\"","","","","","","} } ] }","",""]
[null,null,null,null,null,null,null,null,null,"{","",", \"actions\": [{\"trigger\": {\"type\": \"timestamp\", \"data\": \"",0,"\"}, \"event\": {\"type\":","\"\"","","","","","","} } ] }","",""]
[null,null,null,null,null,null,null,null,null,"{","",", \"actions\": [{\"trigger\": {\"type\": \"timestamp\", \"data\": \"",0,"\"}, \"event\": {\"type\":","\"\"","","","","","","} } ] }","",""]
[null,null,null,null,null,null,null,null,null,"{","",", \"actions\": [{\"trigger\": {\"type\": \"timestamp\", \"data\": \"",0,"\"}, \"event\": {\"type\":","\"\"","","","","","","} } ] }","",""]
[null,null,null,null,null,null,null,null,null,"{","",", \"actions\": [{\"trigger\": {\"type\": \"timestamp\", \"data\": \"",0,"\"}, \"event\": {\"type\":","\"\"","","","","","","} } ] }","",""]
[null,null,null,null,null,null,null,null,null,"{","",", \"actions\": [{\"trigger\": {\"type\": \"timestamp\", \"data\": \"",0,"\"}, \"event\": {\"type\":","\"\"","","","","","","} } ] }","",""]
[null,null,null,null,null,null,null,null,null,"{","",", \"actions\": [{\"trigger\": {\"type\": \"timestamp\", \"data\": \"",0,"\"}, \"event\": {\"type\":","\"\"","","","","","","} } ] }","",""]
[null,null,null,null,null,null,null,null,null,"{","",", \"actions\": [{\"trigger\": {\"type\": \"timestamp\", \"data\": \"",0,"\"}, \"event\": {\"type\":","\"\"","","","","","","} } ] }","",""]
[null,null,null,null,null,null,null,null,null,"{","",", \"actions\": [{\"trigger\": {\"type\": \"timestamp\", \"data\": \"",0,"\"}, \"event\": {\"type\":","\"\"","","","","","","} } ] }","",""]
[null,null,null,null,null,null,null,null,null,"{","",", \"actions\": [{\"trigger\": {\"type\": \"timestamp\", \"data\": \"",0,"\"}, \"event\": {\"type\":","\"\"","","","","","","} } ] }","",""]
[null,null,null,null,null,null,null,null,null,"{","",", \"actions\": [{\"trigger\": {\"type\": \"timestamp\", \"data\": \"",0,"\"}, \"event\": {\"type\":","\"\"","","","","","","} } ] }","",""]
[null,null,null,null,null,null,null,null,null,"{","",", \"actions\": [{\"trigger\": {\"type\": \"timestamp\", \"data\": \"",0,"\"}, \"event\": {\"type\":","\"\"","","","","","","} } ] }","",""]
[null,null,null,null,null,null,null,null,null,"{","",", \"actions\": [{\"trigger\": {\"type\": \"timestamp\", \"data\": \"",0,"\"}, \"event\": {\"type\":","\"\"","","","","","","} } ] }","",""]
[null,null,null,null,null,null,null,null,null,"{","",", \"actions\": [{\"trigger\": {\"type\": \"timestamp\", \"data\": \"",0,"\"}, \"event\": {\"type\":","\"\"","","","","","","} } ] }","",""]
[null,null,null,null,null,null,null,null,null,"{","",", \"actions\": [{\"trigger\": {\"type\": \"timestamp\", \"data\": \"",0,"\"}, \"event\": {\"type\":","\"\"","","","","","","} } ] }","",""]
[null,null,null,null,null,null,null,null,null,"{","",", \"actions\": [{\"trigger\": {\"type\": \"timestamp\", \"data\": \"",0,"\"}, \"event\": {\"type\":","\"\"","","","","","","} } ] }","",""]
[null,null,null,null,null,null,null,null,null,"{","",", \"actions\": [{\"trigger\": {\"type\": \"timestamp\", \"data\": \"",0,"\"}, \"event\": {\"type\":","\"\"","","","","","","} } ] }","",""]
[null,null,null,null,null,null,null,null,null,"{","",", \"actions\": [{\"trigger\": {\"type\": \"timestamp\", \"data\": \"",0,"\"}, \"event\": {\"type\":","\"\"","","","","","","} } ] }","",""]
[null,null,null,null,null,null,null,null,null,"{","",", \"actions\": [{\"trigger\": {\"type\": \"timestamp\", \"data\": \"",0,"\"}, \"event\": {\"type\":","\"\"","","","","","","} } ] }","",""]
[null,null,null,null,null,null,null,null,null,"{","",", \"actions\": [{\"trigger\": {\"type\": \"timestamp\", \"data\": \"",0,"\"}, \"event\": {\"type\":","\"\"","","","","","","} } ] }","",""]
[null,null,null,null,null,null,null,null,null,"{","",", \"actions\": [{\"trigger\": {\"type\": \"timestamp\", \"data\": \"",0,"\"}, \"event\": {\"type\":","\"\"","","","","","","} } ] }","",""]
[null,null,null,null,null,null,null,null,null,"{","",", \"actions\": [{\"trigger\": {\"type\": \"timestamp\", \"data\": \"",0,"\"}, \"event\": {\"type\":","\"\"","","","","","","} } ] }","",""]
[null,null,null,null,null,null,null,null,null,"{","",", \"actions\": [{\"trigger\": {\"type\": \"timestamp\", \"data\": \"",0,"\"}, \"event\": {\"type\":","\"\"","","","","","","} } ] }","",""]
[null,null,null,null,null,null,null,null,null,"{","",", \"actions\": [{\"trigger\": {\"type\": \"timestamp\", \"data\": \"",0,"\"}, \"event\": {\"type\":","\"\"","","","","","","} } ] }","",""]
[null,null,null,null,null,null,null,null,null,"{","",", \"actions\": [{\"trigger\": {\"type\": \"timestamp\", \"data\": \"",0,"\"}, \"event\": {\"type\":","\"\"","","","","","","} } ] }","",""]
[null,null,null,null,null,null,null,null,null,"{","",", \"actions\": [{\"trigger\": {\"type\": \"timestamp\", \"data\": \"",0,"\"}, \"event\": {\"type\":","\"\"","","","","","","} } ] }","",""]
[null,null,null,null,null,null,null,null,null,"{","",", \"actions\": [{\"trigger\": {\"type\": \"timestamp\", \"data\": \"",0,"\"}, \"event\": {\"type\":","\"\"","","","","","","} } ] }","",""]
[null,null,null,null,null,null,null,null,null,"{","",", \"actions\": [{\"trigger\": {\"type\": \"timestamp\", \"data\": \"",0,"\"}, \"event\": {\"type\":","\"\"","","","","","","} } ] }","",""]
[null,null,null,null,null,null,null,null,null,"{","",", \"actions\": [{\"trigger\": {\"type\": \"timestamp\", \"data\": \"",0,"\"}, \"event\": {\"type\":","\"\"","","","","","","} } ] }","",""]
[null,null,null,null,null,null,null,null,null,"{",{"$f":"IF(A911<>\"\",CONCATENATE(\"\"\"\",A$3,\"\"\": \"\"\",$B$1,A911,\"\"\"\"),\"\")","v":""},", \"actions\": [{\"trigger\": {\"type\": \"timestamp\", \"data\": \"",{"$f":"B911*1000","v":0},"\"}, \"event\": {\"type\":",{"$f":"CONCATENATE(\"\"\"\",C911,\"\"\"\")","v":"\"\""},{"$f":"IF(D911<>\"\",CONCATENATE(\",\"\"\",D$3,\"\"\": \"\"\",D911,\"\"\"\"),\"\")","v":""},{"$f":"IF(E911<>\"\",CONCATENATE(\",\"\"\",E$3,\"\"\": \"\"\",E911,\"\"\"\"),\"\")","v":""},{"$f":"IF(F911<>\"\",CONCATENATE(\",\"\"\",F$3,\"\"\": \",F911),\"\")","v":""},{"$f":"IF(G911<>\"\",CONCATENATE(\",\"\"\",G$3,\"\"\": \",G911),\"\")","v":""},{"$f":"IF(H911<>\"\",CONCATENATE(\",\"\"\",H$3,\"\"\": \"\"\",H911,\"\"\"\"),\"\")","v":""},"} } ] }",{"$f":"IF(A911<>\"\",CONCATENATE(J911,K911,L911,M911,N911,O911,P911,Q911,R911,S911,T911,U911),\"\")","v":""},{"$f":"CONCATENATE(IF(AND(W910<>\"\",X910=\"\"),CONCATENATE(W910,IF(A911<>\"\",\",\",\"\")),\"\"),V911)","v":""}]
[null,null,null,null,null,null,null,null,null,"{","",", \"actions\": [{\"trigger\": {\"type\": \"timestamp\", \"data\": \"",0,"\"}, \"event\": {\"type\":","\"\"","","","","","","} } ] }","",""]
[null,null,null,null,null,null,null,null,null,"{","",", \"actions\": [{\"trigger\": {\"type\": \"timestamp\", \"data\": \"",0,"\"}, \"event\": {\"type\":","\"\"","","","","","","} } ] }","",""]
[null,null,null,null,null,null,null,null,null,"{","",", \"actions\": [{\"trigger\": {\"type\": \"timestamp\", \"data\": \"",0,"\"}, \"event\": {\"type\":","\"\"","","","","","","} } ] }","",""]
[null,null,null,null,null,null,null,null,null,"{","",", \"actions\": [{\"trigger\": {\"type\": \"timestamp\", \"data\": \"",0,"\"}, \"event\": {\"type\":","\"\"","","","","","","} } ] }","",""]
[null,null,null,null,null,null,null,null,null,"{","",", \"actions\": [{\"trigger\": {\"type\": \"timestamp\", \"data\": \"",0,"\"}, \"event\": {\"type\":","\"\"","","","","","","} } ] }","",""]
[null,null,null,null,null,null,null,null,null,"{","",", \"actions\": [{\"trigger\": {\"type\": \"timestamp\", \"data\": \"",0,"\"}, \"event\": {\"type\":","\"\"","","","","","","} } ] }","",""]
[null,null,null,null,null,null,null,null,null,"{","",", \"actions\": [{\"trigger\": {\"type\": \"timestamp\", \"data\": \"",0,"\"}, \"event\": {\"type\":","\"\"","","","","","","} } ] }","",""]
[null,null,null,null,null,null,null,null,null,"{","",", \"actions\": [{\"trigger\": {\"type\": \"timestamp\", \"data\": \"",0,"\"}, \"event\": {\"type\":","\"\"","","","","","","} } ] }","",""]
[null,null,null,null,null,null,null,null,null,"{","",", \"actions\": [{\"trigger\": {\"type\": \"timestamp\", \"data\": \"",0,"\"}, \"event\": {\"type\":","\"\"","","","","","","} } ] }","",""]
[null,null,null,null,null,null,null,null,null,"{","",", \"actions\": [{\"trigger\": {\"type\": \"timestamp\", \"data\": \"",0,"\"}, \"event\": {\"type\":","\"\"","","","","","","} } ] }","",""]
[null,null,null,null,null,null,null,null,null,"{","",", \"actions\": [{\"trigger\": {\"type\": \"timestamp\", \"data\": \"",0,"\"}, \"event\": {\"type\":","\"\"","","","","","","} } ] }","",""]
[null,null,null,null,null,null,null,null,null,"{","",", \"actions\": [{\"trigger\": {\"type\": \"timestamp\", \"data\": \"",0,"\"}, \"event\": {\"type\":","\"\"","","","","","","} } ] }","",""]
[null,null,null,null,null,null,null,null,null,"{","",", \"actions\": [{\"trigger\": {\"type\": \"timestamp\", \"data\": \"",0,"\"}, \"event\": {\"type\":","\"\"","","","","","","} } ] }","",""]
[null,null,null,null,null,null,null,null,null,"{","",", \"actions\": [{\"trigger\": {\"type\": \"timestamp\", \"data\": \"",0,"\"}, \"event\": {\"type\":","\"\"","","","","","","} } ] }","",""]
[null,null,null,null,null,null,null,null,null,"{","",", \"actions\": [{\"trigger\": {\"type\": \"timestamp\", \"data\": \"",0,"\"}, \"event\": {\"type\":","\"\"","","","","","","} } ] }","",""]
[null,null,null,null,null,null,null,null,null,"{","",", \"actions\": [{\"trigger\": {\"type\": \"timestamp\", \"data\": \"",0,"\"}, \"event\": {\"type\":","\"\"","","","","","","} } ] }","",""]
[null,null,null,null,null,null,null,null,null,"{","",", \"actions\": [{\"trigger\": {\"type\": \"timestamp\", \"data\": \"",0,"\"}, \"event\": {\"type\":","\"\"","","","","","","} } ] }","",""]
[null,null,null,null,null,null,null,null,null,"{","",", \"actions\": [{\"trigger\": {\"type\": \"timestamp\", \"data\": \"",0,"\"}, \"event\": {\"type\":","\"\"","","","","","","} } ] }","",""]
[null,null,null,null,null,null,null,null,null,"{","",", \"actions\": [{\"trigger\": {\"type\": \"timestamp\", \"data\": \"",0,"\"}, \"event\": {\"type\":","\"\"","","","","","","} } ] }","",""]
[null,null,null,null,null,null,null,null,null,"{","",", \"actions\": [{\"trigger\": {\"type\": \"timestamp\", \"data\": \"",0,"\"}, \"event\": {\"type\":","\"\"","","","","","","} } ] }","",""]
[null,null,null,null,null,null,null,null,null,"{","",", \"actions\": [{\"trigger\": {\"type\": \"timestamp\", \"data\": \"",0,"\"}, \"event\": {\"type\":","\"\"","","","","","","} } ] }","",""]
[null,null,null,null,null,null,null,null,null,"{","",", \"actions\": [{\"trigger\": {\"type\": \"timestamp\", \"data\": \"",0,"\"}, \"event\": {\"type\":","\"\"","","","","","","} } ] }","",""]
[null,null,null,null,null,null,null,null,null,"{","",", \"actions\": [{\"trigger\": {\"type\": \"timestamp\", \"data\": \"",0,"\"}, \"event\": {\"type\":","\"\"","","","","","","} } ] }","",""]
[null,null,null,null,null,null,null,null,null,"{","",", \"actions\": [{\"trigger\": {\"type\": \"timestamp\", \"data\": \"",0,"\"}, \"event\": {\"type\":","\"\"","","","","","","} } ] }","",""]
[null,null,null,null,null,null,null,null,null,"{","",", \"actions\": [{\"trigger\": {\"type\": \"timestamp\", \"data\": \"",0,"\"}, \"event\": {\"type\":","\"\"","","","","","","} } ] }","",""]
[null,null,null,null,null,null,null,null,null,"{","",", \"actions\": [{\"trigger\": {\"type\": \"timestamp\", \"data\": \"",0,"\"}, \"event\": {\"type\":","\"\"","","","","","","} } ] }","",""]
[null,null,null,null,null,null,null,null,null,"{","",", \"actions\": [{\"trigger\": {\"type\": \"timestamp\", \"data\": \"",0,"\"}, \"event\": {\"type\":","\"\"","","","","","","} } ] }","",""]
[null,null,null,null,null,null,null,null,null,"{","",", \"actions\": [{\"trigger\": {\"type\": \"timestamp\", \"data\": \"",0,"\"}, \"event\": {\"type\":","\"\"","","","","","","} } ] }","",""]
[null,null,null,null,null,null,null,null,null,"{","",", \"actions\": [{\"trigger\": {\"type\": \"timestamp\", \"data\": \"",0,"\"}, \"event\": {\"type\":","\"\"","","","","","","} } ] }","",""]
[null,null,null,null,null,null,null,null,null,"{","",", \"actions\": [{\"trigger\": {\"type\": \"timestamp\", \"data\": \"",0,"\"}, \"event\": {\"type\":","\"\"","","","","","","} } ] }","",""]
[null,null,null,null,null,null,null,null,null,"{","",", \"actions\": [{\"trigger\": {\"type\": \"timestamp\", \"data\": \"",0,"\"}, \"event\": {\"type\":","\"\"","","","","","","} } ] }","",""]
[null,null,null,null,null,null,null,null,null,"{","",", \"actions\": [{\"trigger\": {\"type\": \"timestamp\", \"data\": \"",0,"\"}, \"event\": {\"type\":","\"\"","","","","","","} } ] }","",""]
[null,null,null,null,null,null,null,null,null,"{","",", \"actions\": [{\"trigger\": {\"type\": \"timestamp\", \"data\": \"",0,"\"}, \"event\": {\"type\":","\"\"","","","","","","} } ] }","",""]
[null,null,null,null,null,null,null,null,null,"{","",", \"actions\": [{\"trigger\": {\"type\": \"timestamp\", \"data\": \"",0,"\"}, \"event\": {\"type\":","\"\"","","","","","","} } ] }","",""]
[null,null,null,null,null,null,null,null,null,"{","",", \"actions\": [{\"trigger\": {\"type\": \"timestamp\", \"data\": \"",0,"\"}, \"event\": {\"type\":","\"\"","","","","","","} } ] }","",""]
[null,null,null,null,null,null,null,null,null,"{","",", \"actions\": [{\"trigger\": {\"type\": \"timestamp\", \"data\": \"",0,"\"}, \"event\": {\"type\":","\"\"","","","","","","} } ] }","",""]
[null,null,null,null,null,null,null,null,null,"{","",", \"actions\": [{\"trigger\": {\"type\": \"timestamp\", \"data\": \"",0,"\"}, \"event\": {\"type\":","\"\"","","","","","","} } ] }","",""]
[null,null,null,null,null,null,null,null,null,"{","",", \"actions\": [{\"trigger\": {\"type\": \"timestamp\", \"data\": \"",0,"\"}, \"event\": {\"type\":","\"\"","","","","","","} } ] }","",""]
[null,null,null,null,null,null,null,null,null,"{","",", \"actions\": [{\"trigger\": {\"type\": \"timestamp\", \"data\": \"",0,"\"}, \"event\": {\"type\":","\"\"","","","","","","} } ] }","",""]
[null,null,null,null,null,null,null,null,null,"{","",", \"actions\": [{\"trigger\": {\"type\": \"timestamp\", \"data\": \"",0,"\"}, \"event\": {\"type\":","\"\"","","","","","","} } ] }","",""]
[null,null,null,null,null,null,null,null,null,"{","",", \"actions\": [{\"trigger\": {\"type\": \"timestamp\", \"data\": \"",0,"\"}, \"event\": {\"type\":","\"\"","","","","","","} } ] }","",""]
[null,null,null,null,null,null,null,null,null,"{","",", \"actions\": [{\"trigger\": {\"type\": \"timestamp\", \"data\": \"",0,"\"}, \"event\": {\"type\":","\"\"","","","","","","} } ] }","",""]
[null,null,null,null,null,null,null,null,null,"{","",", \"actions\": [{\"trigger\": {\"type\": \"timestamp\", \"data\": \"",0,"\"}, \"event\": {\"type\":","\"\"","","","","","","} } ] }","",""]
[null,null,null,null,null,null,null,null,null,"{","",", \"actions\": [{\"trigger\": {\"type\": \"timestamp\", \"data\": \"",0,"\"}, \"event\": {\"type\":","\"\"","","","","","","} } ] }","",""]
[null,null,null,null,null,null,null,null,null,"{","",", \"actions\": [{\"trigger\": {\"type\": \"timestamp\", \"data\": \"",0,"\"}, \"event\": {\"type\":","\"\"","","","","","","} } ] }","",""]
[null,null,null,null,null,null,null,null,null,"{","",", \"actions\": [{\"trigger\": {\"type\": \"timestamp\", \"data\": \"",0,"\"}, \"event\": {\"type\":","\"\"","","","","","","} } ] }","",""]
[null,null,null,null,null,null,null,null,null,"{","",", \"actions\": [{\"trigger\": {\"type\": \"timestamp\", \"data\": \"",0,"\"}, \"event\": {\"type\":","\"\"","","","","","","} } ] }","",""]
[null,null,null,null,null,null,null,null,null,"{","",", \"actions\": [{\"trigger\": {\"type\": \"timestamp\", \"data\": \"",0,"\"}, \"event\": {\"type\":","\"\"","","","","","","} } ] }","",""]
[null,null,null,null,null,null,null,null,null,"{","",", \"actions\": [{\"trigger\": {\"type\": \"timestamp\", \"data\": \"",0,"\"}, \"event\": {\"type\":","\"\"","","","","","","} } ] }","",""]
[null,null,null,null,null,null,null,null,null,"{","",", \"actions\": [{\"trigger\": {\"type\": \"timestamp\", \"data\": \"",0,"\"}, \"event\": {\"type\":","\"\"","","","","","","} } ] }","",""]
[null,null,null,null,null,null,null,null,null,"{","",", \"actions\": [{\"trigger\": {\"type\": \"timestamp\", \"data\": \"",0,"\"}, \"event\": {\"type\":","\"\"","","","","","","} } ] }","",""]
[null,null,null,null,null,null,null,null,null,"{","",", \"actions\": [{\"trigger\": {\"type\": \"timestamp\", \"data\": \"",0,"\"}, \"event\": {\"type\":","\"\"","","","","","","} } ] }","",""]
[null,null,null,null,null,null,null,null,null,"{","",", \"actions\": [{\"trigger\": {\"type\": \"timestamp\", \"data\": \"",0,"\"}, \"event\": {\"type\":","\"\"","","","","","","} } ] }","",""]
[null,null,null,null,null,null,null,null,null,"{","",", \"actions\": [{\"trigger\": {\"type\": \"timestamp\", \"data\": \"",0,"\"}, \"event\": {\"type\":","\"\"","","","","","","} } ] }","",""]
[null,null,null,null,null,null,null,null,null,"{","",", \"actions\": [{\"trigger\": {\"type\": \"timestamp\", \"data\": \"",0,"\"}, \"event\": {\"type\":","\"\"","","","","","","} } ] }","",""]
[null,null,null,null,null,null,null,null,null,"{","",", \"actions\": [{\"trigger\": {\"type\": \"timestamp\", \"data\": \"",0,"\"}, \"event\": {\"type\":","\"\"","","","","","","} } ] }","",""]
[null,null,null,null,null,null,null,null,null,"{","",", \"actions\": [{\"trigger\": {\"type\": \"timestamp\", \"data\": \"",0,"\"}, \"event\": {\"type\":","\"\"","","","","","","} } ] }","",""]
[null,null,null,null,null,null,null,null,null,"{","",", \"actions\": [{\"trigger\": {\"type\": \"timestamp\", \"data\": \"",0,"\"}, \"event\": {\"type\":","\"\"","","","","","","} } ] }","",""]
[null,null,null,null,null,null,null,null,null,"{","",", \"actions\": [{\"trigger\": {\"type\": \"timestamp\", \"data\": \"",0,"\"}, \"event\": {\"type\":","\"\"","","","","","","} } ] }","",""]
[null,null,null,null,null,null,null,null,null,"{","",", \"actions\": [{\"trigger\": {\"type\": \"timestamp\", \"data\": \"",0,"\"}, \"event\": {\"type\":","\"\"","","","","","","} } ] }","",""]
[null,null,null,null,null,null,null,null,null,"{","",", \"actions\": [{\"trigger\": {\"type\": \"timestamp\", \"data\": \"",0,"\"}, \"event\": {\"type\":","\"\"","","","","","","} } ] }","",""]
[null,null,null,null,null,null,null,null,null,"{","",", \"actions\": [{\"trigger\": {\"type\": \"timestamp\", \"data\": \"",0,"\"}, \"event\": {\"type\":","\"\"","","","","","","} } ] }","",""]
[null,null,null,null,null,null,null,null,null,"{","",", \"actions\": [{\"trigger\": {\"type\": \"timestamp\", \"data\": \"",0,"\"}, \"event\": {\"type\":","\"\"","","","","","","} } ] }","",""]
[null,null,null,null,null,null,null,null,null,"{",{"$f":"IF(A975<>\"\",CONCATENATE(\"\"\"\",A$3,\"\"\": \"\"\",$B$1,A975,\"\"\"\"),\"\")","v":""},", \"actions\": [{\"trigger\": {\"type\": \"timestamp\", \"data\": \"",{"$f":"B975*1000","v":0},"\"}, \"event\": {\"type\":",{"$f":"CONCATENATE(\"\"\"\",C975,\"\"\"\")","v":"\"\""},{"$f":"IF(D975<>\"\",CONCATENATE(\",\"\"\",D$3,\"\"\": \"\"\",D975,\"\"\"\"),\"\")","v":""},{"$f":"IF(E975<>\"\",CONCATENATE(\",\"\"\",E$3,\"\"\": \"\"\",E975,\"\"\"\"),\"\")","v":""},{"$f":"IF(F975<>\"\",CONCATENATE(\",\"\"\",F$3,\"\"\": \",F975),\"\")","v":""},{"$f":"IF(G975<>\"\",CONCATENATE(\",\"\"\",G$3,\"\"\": \",G975),\"\")","v":""},{"$f":"IF(H975<>\"\",CONCATENATE(\",\"\"\",H$3,\"\"\": \"\"\",H975,\"\"\"\"),\"\")","v":""},"} } ] }",{"$f":"IF(A975<>\"\",CONCATENATE(J975,K975,L975,M975,N975,O975,P975,Q975,R975,S975,T975,U975),\"\")","v":""},{"$f":"CONCATENATE(IF(AND(W974<>\"\",X974=\"\"),CONCATENATE(W974,IF(A975<>\"\",\",\",\"\")),\"\"),V975)","v":""}]
[null,null,null,null,null,null,null,null,null,"{","",", \"actions\": [{\"trigger\": {\"type\": \"timestamp\", \"data\": \"",0,"\"}, \"event\": {\"type\":","\"\"","","","","","","} } ] }","",""]
[null,null,null,null,null,null,null,null,null,"{","",", \"actions\": [{\"trigger\": {\"type\": \"timestamp\", \"data\": \"",0,"\"}, \"event\": {\"type\":","\"\"","","","","","","} } ] }","",""]
[null,null,null,null,null,null,null,null,null,"{","",", \"actions\": [{\"trigger\": {\"type\": \"timestamp\", \"data\": \"",0,"\"}, \"event\": {\"type\":","\"\"","","","","","","} } ] }","",""]
[null,null,null,null,null,null,null,null,null,"{","",", \"actions\": [{\"trigger\": {\"type\": \"timestamp\", \"data\": \"",0,"\"}, \"event\": {\"type\":","\"\"","","","","","","} } ] }","",""]
[null,null,null,null,null,null,null,null,null,"{","",", \"actions\": [{\"trigger\": {\"type\": \"timestamp\", \"data\": \"",0,"\"}, \"event\": {\"type\":","\"\"","","","","","","} } ] }","",""]
[null,null,null,null,null,null,null,null,null,"{","",", \"actions\": [{\"trigger\": {\"type\": \"timestamp\", \"data\": \"",0,"\"}, \"event\": {\"type\":","\"\"","","","","","","} } ] }","",""]
[null,null,null,null,null,null,null,null,null,"{","",", \"actions\": [{\"trigger\": {\"type\": \"timestamp\", \"data\": \"",0,"\"}, \"event\": {\"type\":","\"\"","","","","","","} } ] }","",""]
[null,null,null,null,null,null,null,null,null,"{","",", \"actions\": [{\"trigger\": {\"type\": \"timestamp\", \"data\": \"",0,"\"}, \"event\": {\"type\":","\"\"","","","","","","} } ] }","",""]
[null,null,null,null,null,null,null,null,null,"{","",", \"actions\": [{\"trigger\": {\"type\": \"timestamp\", \"data\": \"",0,"\"}, \"event\": {\"type\":","\"\"","","","","","","} } ] }","",""]
[null,null,null,null,null,null,null,null,null,"{","",", \"actions\": [{\"trigger\": {\"type\": \"timestamp\", \"data\": \"",0,"\"}, \"event\": {\"type\":","\"\"","","","","","","} } ] }","",""]
[null,null,null,null,null,null,null,null,null,"{","",", \"actions\": [{\"trigger\": {\"type\": \"timestamp\", \"data\": \"",0,"\"}, \"event\": {\"type\":","\"\"","","","","","","} } ] }","",""]
[null,null,null,null,null,null,null,null,null,"{","",", \"actions\": [{\"trigger\": {\"type\": \"timestamp\", \"data\": \"",0,"\"}, \"event\": {\"type\":","\"\"","","","","","","} } ] }","",""]
[null,null,null,null,null,null,null,null,null,"{","",", \"actions\": [{\"trigger\": {\"type\": \"timestamp\", \"data\": \"",0,"\"}, \"event\": {\"type\":","\"\"","","","","","","} } ] }","",""]
[null,null,null,null,null,null,null,null,null,"{","",", \"actions\": [{\"trigger\": {\"type\": \"timestamp\", \"data\": \"",0,"\"}, \"event\": {\"type\":","\"\"","","","","","","} } ] }","",""]
[null,null,null,null,null,null,null,null,null,"{","",", \"actions\": [{\"trigger\": {\"type\": \"timestamp\", \"data\": \"",0,"\"}, \"event\": {\"type\":","\"\"","","","","","","} } ] }","",""]
[null,null,null,null,null,null,null,null,null,"{","",", \"actions\": [{\"trigger\": {\"type\": \"timestamp\", \"data\": \"",0,"\"}, \"event\": {\"type\":","\"\"","","","","","","} } ] }","",""]
[null,null,null,null,null,null,null,null,null,"{","",", \"actions\": [{\"trigger\": {\"type\": \"timestamp\", \"data\": \"",0,"\"}, \"event\": {\"type\":","\"\"","","","","","","} } ] }","",""]
[null,null,null,null,null,null,null,null,null,"{","",", \"actions\": [{\"trigger\": {\"type\": \"timestamp\", \"data\": \"",0,"\"}, \"event\": {\"type\":","\"\"","","","","","","} } ] }","",""]
[null,null,null,null,null,null,null,null,null,"{","",", \"actions\": [{\"trigger\": {\"type\": \"timestamp\", \"data\": \"",0,"\"}, \"event\": {\"type\":","\"\"","","","","","","} } ] }","",""]
[null,null,null,null,null,null,null,null,null,"{","",", \"actions\": [{\"trigger\": {\"type\": \"timestamp\", \"data\": \"",0,"\"}, \"event\": {\"type\":","\"\"","","","","","","} } ] }","",""]
[null,null,null,null,null,null,null,null,null,"{","",", \"actions\": [{\"trigger\": {\"type\": \"timestamp\", \"data\": \"",0,"\"}, \"event\": {\"type\":","\"\"","","","","","","} } ] }","",""]
[null,null,null,null,null,null,null,null,null,"{","",", \"actions\": [{\"trigger\": {\"type\": \"timestamp\", \"data\": \"",0,"\"}, \"event\": {\"type\":","\"\"","","","","","","} } ] }","",""]
[null,null,null,null,null,null,null,null,null,"{","",", \"actions\": [{\"trigger\": {\"type\": \"timestamp\", \"data\": \"",0,"\"}, \"event\": {\"type\":","\"\"","","","","","","} } ] }","",""]
[null,null,null,null,null,null,null,null,null,"{","",", \"actions\": [{\"trigger\": {\"type\": \"timestamp\", \"data\": \"",0,"\"}, \"event\": {\"type\":","\"\"","","","","","","} } ] }","",""]
[null,null,null,null,null,null,null,null,null,"{","",", \"actions\": [{\"trigger\": {\"type\": \"timestamp\", \"data\": \"",0,"\"}, \"event\": {\"type\":","\"\"","","","","","","} } ] }","",""]
[null,null,null,null,null,null,null,null,null,"{","",", \"actions\": [{\"trigger\": {\"type\": \"timestamp\", \"data\": \"",0,"\"}, \"event\": {\"type\":","\"\"","","","","","","} } ] }","",""]
[null,null,null,null,null,null,null,null,null,"{","",", \"actions\": [{\"trigger\": {\"type\": \"timestamp\", \"data\": \"",0,"\"}, \"event\": {\"type\":","\"\"","","","","","","} } ] }","",""]
[null,null,null,null,null,null,null,null,null,"{","",", \"actions\": [{\"trigger\": {\"type\": \"timestamp\", \"data\": \"",0,"\"}, \"event\": {\"type\":","\"\"","","","","","","} } ] }","",""]
[null,null,null,null,null,null,null,null,null,"{","",", \"actions\": [{\"trigger\": {\"type\": \"timestamp\", \"data\": \"",0,"\"}, \"event\": {\"type\":","\"\"","","","","","","} } ] }","",""]
[null,null,null,null,null,null,null,null,null,"{","",", \"actions\": [{\"trigger\": {\"type\": \"timestamp\", \"data\": \"",0,"\"}, \"event\": {\"type\":","\"\"","","","","","","} } ] }","",""]
[null,null,null,null,null,null,null,null,null,"{","",", \"actions\": [{\"trigger\": {\"type\": \"timestamp\", \"data\": \"",0,"\"}, \"event\": {\"type\":","\"\"","","","","","","} } ] }","",""]
[null,null,null,null,null,null,null,null,null,"{","",", \"actions\": [{\"trigger\": {\"type\": \"timestamp\", \"data\": \"",0,"\"}, \"event\": {\"type\":","\"\"","","","","","","} } ] }","",""]
[null,null,null,null,null,null,null,null,null,"{","",", \"actions\": [{\"trigger\": {\"type\": \"timestamp\", \"data\": \"",0,"\"}, \"event\": {\"type\":","\"\"","","","","","","} } ] }","",""]
[null,null,null,null,null,null,null,null,null,"{","",", \"actions\": [{\"trigger\": {\"type\": \"timestamp\", \"data\": \"",0,"\"}, \"event\": {\"type\":","\"\"","","","","","","} } ] }","",""]
[null,null,null,null,null,null,null,null,null,"{","",", \"actions\": [{\"trigger\": {\"type\": \"timestamp\", \"data\": \"",0,"\"}, \"event\": {\"type\":","\"\"","","","","","","} } ] }","",""]
[null,null,null,null,null,null,null,null,null,"{","",", \"actions\": [{\"trigger\": {\"type\": \"timestamp\", \"data\": \"",0,"\"}, \"event\": {\"type\":","\"\"","","","","","","} } ] }","",""]
[null,null,null,null,null,null,null,null,null,"{","",", \"actions\": [{\"trigger\": {\"type\": \"timestamp\", \"data\": \"",0,"\"}, \"event\": {\"type\":","\"\"","","","","","","} } ] }","",""]
[null,null,null,null,null,null,null,null,null,"{","",", \"actions\": [{\"trigger\": {\"type\": \"timestamp\", \"data\": \"",0,"\"}, \"event\": {\"type\":","\"\"","","","","","","} } ] }","",""]
[null,null,null,null,null,null,null,null,null,"{","",", \"actions\": [{\"trigger\": {\"type\": \"timestamp\", \"data\": \"",0,"\"}, \"event\": {\"type\":","\"\"","","","","","","} } ] }","",""]
[null,null,null,null,null,null,null,null,null,"{","",", \"actions\": [{\"trigger\": {\"type\": \"timestamp\", \"data\": \"",0,"\"}, \"event\": {\"type\":","\"\"","","","","","","} } ] }","",""]
[null,null,null,null,null,null,null,null,null,"{","",", \"actions\": [{\"trigger\": {\"type\": \"timestamp\", \"data\": \"",0,"\"}, \"event\": {\"type\":","\"\"","","","","","","} } ] }","",""]
[null,null,null,null,null,null,null,null,null,"{","",", \"actions\": [{\"trigger\": {\"type\": \"timestamp\", \"data\": \"",0,"\"}, \"event\": {\"type\":","\"\"","","","","","","} } ] }","",""]
[null,null,null,null,null,null,null,null,null,"{","",", \"actions\": [{\"trigger\": {\"type\": \"timestamp\", \"data\": \"",0,"\"}, \"event\": {\"type\":","\"\"","","","","","","} } ] }","",""]
[null,null,null,null,null,null,null,null,null,"{","",", \"actions\": [{\"trigger\": {\"type\": \"timestamp\", \"data\": \"",0,"\"}, \"event\": {\"type\":","\"\"","","","","","","} } ] }","",""]
[null,null,null,null,null,null,null,null,null,"{","",", \"actions\": [{\"trigger\": {\"type\": \"timestamp\", \"data\": \"",0,"\"}, \"event\": {\"type\":","\"\"","","","","","","} } ] }","",""]
[null,null,null,null,null,null,null,null,null,"{","",", \"actions\": [{\"trigger\": {\"type\": \"timestamp\", \"data\": \"",0,"\"}, \"event\": {\"type\":","\"\"","","","","","","} } ] }","",""]
[null,null,null,null,null,null,null,null,null,"{","",", \"actions\": [{\"trigger\": {\"type\": \"timestamp\", \"data\": \"",0,"\"}, \"event\": {\"type\":","\"\"","","","","","","} } ] }","",""]
[null,null,null,null,null,null,null,null,null,"{","",", \"actions\": [{\"trigger\": {\"type\": \"timestamp\", \"data\": \"",0,"\"}, \"event\": {\"type\":","\"\"","","","","","","} } ] }","",""]
[null,null,null,null,null,null,null,null,null,"{","",", \"actions\": [{\"trigger\": {\"type\": \"timestamp\", \"data\": \"",0,"\"}, \"event\": {\"type\":","\"\"","","","","","","} } ] }","",""]
[null,null,null,null,null,null,null,null,null,"{","",", \"actions\": [{\"trigger\": {\"type\": \"timestamp\", \"data\": \"",0,"\"}, \"event\": {\"type\":","\"\"","","","","","","} } ] }","",""]
[null,null,null,null,null,null,null,null,null,"{","",", \"actions\": [{\"trigger\": {\"type\": \"timestamp\", \"data\": \"",0,"\"}, \"event\": {\"type\":","\"\"","","","","","","} } ] }","",""]
[null,null,null,null,null,null,null,null,null,"{","",", \"actions\": [{\"trigger\": {\"type\": \"timestamp\", \"data\": \"",0,"\"}, \"event\": {\"type\":","\"\"","","","","","","} } ] }","",""]
[null,null,null,null,null,null,null,null,null,"{","",", \"actions\": [{\"trigger\": {\"type\": \"timestamp\", \"data\": \"",0,"\"}, \"event\": {\"type\":","\"\"","","","","","","} } ] }","","",5]
[null,null,null,null,null,null,null,null,null,"{","",", \"actions\": [{\"trigger\": {\"type\": \"timestamp\", \"data\": \"",0,"\"}, \"event\": {\"type\":","\"\"","","","","","","} } ] }","",""]
[null,null,null,null,null,null,null,null,null,"{","",", \"actions\": [{\"trigger\": {\"type\": \"timestamp\", \"data\": \"",0,"\"}, \"event\": {\"type\":","\"\"","","","","","","} } ] }","",""]
[null,null,null,null,null,null,null,null,null,"{","",", \"actions\": [{\"trigger\": {\"type\": \"timestamp\", \"data\": \"",0,"\"}, \"event\": {\"type\":","\"\"","","","","","","} } ] }","",""]
[null,null,null,null,null,null,null,null,null,"{","",", \"actions\": [{\"trigger\": {\"type\": \"timestamp\", \"data\": \"",0,"\"}, \"event\": {\"type\":","\"\"","","","","","","} } ] }","",""]
[null,null,null,null,null,null,null,null,null,"{","",", \"actions\": [{\"trigger\": {\"type\": \"timestamp\", \"data\": \"",0,"\"}, \"event\": {\"type\":","\"\"","","","","","","} } ] }","",""]
[null,null,null,null,null,null,null,null,null,"{","",", \"actions\": [{\"trigger\": {\"type\": \"timestamp\", \"data\": \"",0,"\"}, \"event\": {\"type\":","\"\"","","","","","","} } ] }","",""]
[null,null,null,null,null,null,null,null,null,"{","",", \"actions\": [{\"trigger\": {\"type\": \"timestamp\", \"data\": \"",0,"\"}, \"event\": {\"type\":","\"\"","","","","","","} } ] }","",""]
[null,null,null,null,null,null,null,null,null,"{","",", \"actions\": [{\"trigger\": {\"type\": \"timestamp\", \"data\": \"",0,"\"}, \"event\": {\"type\":","\"\"","","","","","","} } ] }","",""]
[null,null,null,null,null,null,null,null,null,"{","",", \"actions\": [{\"trigger\": {\"type\": \"timestamp\", \"data\": \"",0,"\"}, \"event\": {\"type\":","\"\"","","","","","","} } ] }","",""]
[null,null,null,null,null,null,null,null,null,"{","",", \"actions\": [{\"trigger\": {\"type\": \"timestamp\", \"data\": \"",0,"\"}, \"event\": {\"type\":","\"\"","","","","","","} } ] }","",""]
[null,null,null,null,null,null,null,null,null,"{",{"$f":"IF(A1039<>\"\",CONCATENATE(\"\"\"\",A$3,\"\"\": \"\"\",$B$1,A1039,\"\"\"\"),\"\")","v":""},", \"actions\": [{\"trigger\": {\"type\": \"timestamp\", \"data\": \"",{"$f":"B1039*1000","v":0},"\"}, \"event\": {\"type\":",{"$f":"CONCATENATE(\"\"\"\",C1039,\"\"\"\")","v":"\"\""},{"$f":"IF(D1039<>\"\",CONCATENATE(\",\"\"\",D$3,\"\"\": \"\"\",D1039,\"\"\"\"),\"\")","v":""},{"$f":"IF(E1039<>\"\",CONCATENATE(\",\"\"\",E$3,\"\"\": \"\"\",E1039,\"\"\"\"),\"\")","v":""},{"$f":"IF(F1039<>\"\",CONCATENATE(\",\"\"\",F$3,\"\"\": \",F1039),\"\")","v":""},{"$f":"IF(G1039<>\"\",CONCATENATE(\",\"\"\",G$3,\"\"\": \",G1039),\"\")","v":""},{"$f":"IF(H1039<>\"\",CONCATENATE(\",\"\"\",H$3,\"\"\": \"\"\",H1039,\"\"\"\"),\"\")","v":""},"} } ] }",{"$f":"IF(A1039<>\"\",CONCATENATE(J1039,K1039,L1039,M1039,N1039,O1039,P1039,Q1039,R1039,S1039,T1039,U1039),\"\")","v":""},{"$f":"CONCATENATE(IF(AND(W1038<>\"\",X1038=\"\"),CONCATENATE(W1038,IF(A1039<>\"\",\",\",\"\")),\"\"),V1039)","v":""}]
[null,null,null,null,null,null,null,null,null,"{","",", \"actions\": [{\"trigger\": {\"type\": \"timestamp\", \"data\": \"",0,"\"}, \"event\": {\"type\":","\"\"","","","","","","} } ] }","",""]
[null,null,null,null,null,null,null,null,null,"{","",", \"actions\": [{\"trigger\": {\"type\": \"timestamp\", \"data\": \"",0,"\"}, \"event\": {\"type\":","\"\"","","","","","","} } ] }","",""]
[null,null,null,null,null,null,null,null,null,"{","",", \"actions\": [{\"trigger\": {\"type\": \"timestamp\", \"data\": \"",0,"\"}, \"event\": {\"type\":","\"\"","","","","","","} } ] }","",""]
[null,null,null,null,null,null,null,null,null,"{","",", \"actions\": [{\"trigger\": {\"type\": \"timestamp\", \"data\": \"",0,"\"}, \"event\": {\"type\":","\"\"","","","","","","} } ] }","",""]
[null,null,null,null,null,null,null,null,null,"{","",", \"actions\": [{\"trigger\": {\"type\": \"timestamp\", \"data\": \"",0,"\"}, \"event\": {\"type\":","\"\"","","","","","","} } ] }","",""]
[null,null,null,null,null,null,null,null,null,"{","",", \"actions\": [{\"trigger\": {\"type\": \"timestamp\", \"data\": \"",0,"\"}, \"event\": {\"type\":","\"\"","","","","","","} } ] }","",""]
[null,null,null,null,null,null,null,null,null,"{","",", \"actions\": [{\"trigger\": {\"type\": \"timestamp\", \"data\": \"",0,"\"}, \"event\": {\"type\":","\"\"","","","","","","} } ] }","",""]
[null,null,null,null,null,null,null,null,null,"{","",", \"actions\": [{\"trigger\": {\"type\": \"timestamp\", \"data\": \"",0,"\"}, \"event\": {\"type\":","\"\"","","","","","","} } ] }","",""]
[null,null,null,null,null,null,null,null,null,"{","",", \"actions\": [{\"trigger\": {\"type\": \"timestamp\", \"data\": \"",0,"\"}, \"event\": {\"type\":","\"\"","","","","","","} } ] }","",""]
[null,null,null,null,null,null,null,null,null,"{","",", \"actions\": [{\"trigger\": {\"type\": \"timestamp\", \"data\": \"",0,"\"}, \"event\": {\"type\":","\"\"","","","","","","} } ] }","",""]
[null,null,null,null,null,null,null,null,null,"{","",", \"actions\": [{\"trigger\": {\"type\": \"timestamp\", \"data\": \"",0,"\"}, \"event\": {\"type\":","\"\"","","","","","","} } ] }","",""]
[null,null,null,null,null,null,null,null,null,"{","",", \"actions\": [{\"trigger\": {\"type\": \"timestamp\", \"data\": \"",0,"\"}, \"event\": {\"type\":","\"\"","","","","","","} } ] }","",""]
[null,null,null,null,null,null,null,null,null,"{","",", \"actions\": [{\"trigger\": {\"type\": \"timestamp\", \"data\": \"",0,"\"}, \"event\": {\"type\":","\"\"","","","","","","} } ] }","",""]
[null,null,null,null,null,null,null,null,null,"{","",", \"actions\": [{\"trigger\": {\"type\": \"timestamp\", \"data\": \"",0,"\"}, \"event\": {\"type\":","\"\"","","","","","","} } ] }","",""]
[null,null,null,null,null,null,null,null,null,"{","",", \"actions\": [{\"trigger\": {\"type\": \"timestamp\", \"data\": \"",0,"\"}, \"event\": {\"type\":","\"\"","","","","","","} } ] }","",""]
[null,null,null,null,null,null,null,null,null,"{","",", \"actions\": [{\"trigger\": {\"type\": \"timestamp\", \"data\": \"",0,"\"}, \"event\": {\"type\":","\"\"","","","","","","} } ] }","",""]
[null,null,null,null,null,null,null,null,null,"{","",", \"actions\": [{\"trigger\": {\"type\": \"timestamp\", \"data\": \"",0,"\"}, \"event\": {\"type\":","\"\"","","","","","","} } ] }","",""]
[null,null,null,null,null,null,null,null,null,"{","",", \"actions\": [{\"trigger\": {\"type\": \"timestamp\", \"data\": \"",0,"\"}, \"event\": {\"type\":","\"\"","","","","","","} } ] }","",""]
[null,null,null,null,null,null,null,null,null,"{","",", \"actions\": [{\"trigger\": {\"type\": \"timestamp\", \"data\": \"",0,"\"}, \"event\": {\"type\":","\"\"","","","","","","} } ] }","",""]
[null,null,null,null,null,null,null,null,null,"{","",", \"actions\": [{\"trigger\": {\"type\": \"timestamp\", \"data\": \"",0,"\"}, \"event\": {\"type\":","\"\"","","","","","","} } ] }","",""]
[null,null,null,null,null,null,null,null,null,"{","",", \"actions\": [{\"trigger\": {\"type\": \"timestamp\", \"data\": \"",0,"\"}, \"event\": {\"type\":","\"\"","","","","","","} } ] }","",""]
[null,null,null,null,null,null,null,null,null,"{","",", \"actions\": [{\"trigger\": {\"type\": \"timestamp\", \"data\": \"",0,"\"}, \"event\": {\"type\":","\"\"","","","","","","} } ] }","",""]
[null,null,null,null,null,null,null,null,null,"{","",", \"actions\": [{\"trigger\": {\"type\": \"timestamp\", \"data\": \"",0,"\"}, \"event\": {\"type\":","\"\"","","","","","","} } ] }","",""]
[null,null,null,null,null,null,null,null,null,"{","",", \"actions\": [{\"trigger\": {\"type\": \"timestamp\", \"data\": \"",0,"\"}, \"event\": {\"type\":","\"\"","","","","","","} } ] }","",""]
[null,null,null,null,null,null,null,null,null,"{","",", \"actions\": [{\"trigger\": {\"type\": \"timestamp\", \"data\": \"",0,"\"}, \"event\": {\"type\":","\"\"","","","","","","} } ] }","",""]
[null,null,null,null,null,null,null,null,null,"{","",", \"actions\": [{\"trigger\": {\"type\": \"timestamp\", \"data\": \"",0,"\"}, \"event\": {\"type\":","\"\"","","","","","","} } ] }","",""]
[null,null,null,null,null,null,null,null,null,"{","",", \"actions\": [{\"trigger\": {\"type\": \"timestamp\", \"data\": \"",0,"\"}, \"event\": {\"type\":","\"\"","","","","","","} } ] }","",""]
[null,null,null,null,null,null,null,null,null,"{","",", \"actions\": [{\"trigger\": {\"type\": \"timestamp\", \"data\": \"",0,"\"}, \"event\": {\"type\":","\"\"","","","","","","} } ] }","",""]
[null,null,null,null,null,null,null,null,null,"{","",", \"actions\": [{\"trigger\": {\"type\": \"timestamp\", \"data\": \"",0,"\"}, \"event\": {\"type\":","\"\"","","","","","","} } ] }","",""]
[null,null,null,null,null,null,null,null,null,"{","",", \"actions\": [{\"trigger\": {\"type\": \"timestamp\", \"data\": \"",0,"\"}, \"event\": {\"type\":","\"\"","","","","","","} } ] }","",""]
[null,null,null,null,null,null,null,null,null,"{","",", \"actions\": [{\"trigger\": {\"type\": \"timestamp\", \"data\": \"",0,"\"}, \"event\": {\"type\":","\"\"","","","","","","} } ] }","",""]
[null,null,null,null,null,null,null,null,null,"{","",", \"actions\": [{\"trigger\": {\"type\": \"timestamp\", \"data\": \"",0,"\"}, \"event\": {\"type\":","\"\"","","","","","","} } ] }","",""]
[null,null,null,null,null,null,null,null,null,"{","",", \"actions\": [{\"trigger\": {\"type\": \"timestamp\", \"data\": \"",0,"\"}, \"event\": {\"type\":","\"\"","","","","","","} } ] }","",""]
[null,null,null,null,null,null,null,null,null,"{","",", \"actions\": [{\"trigger\": {\"type\": \"timestamp\", \"data\": \"",0,"\"}, \"event\": {\"type\":","\"\"","","","","","","} } ] }","",""]
[null,null,null,null,null,null,null,null,null,"{","",", \"actions\": [{\"trigger\": {\"type\": \"timestamp\", \"data\": \"",0,"\"}, \"event\": {\"type\":","\"\"","","","","","","} } ] }","",""]
[null,null,null,null,null,null,null,null,null,"{","",", \"actions\": [{\"trigger\": {\"type\": \"timestamp\", \"data\": \"",0,"\"}, \"event\": {\"type\":","\"\"","","","","","","} } ] }","",""]
[null,null,null,null,null,null,null,null,null,"{","",", \"actions\": [{\"trigger\": {\"type\": \"timestamp\", \"data\": \"",0,"\"}, \"event\": {\"type\":","\"\"","","","","","","} } ] }","",""]
[null,null,null,null,null,null,null,null,null,"{","",", \"actions\": [{\"trigger\": {\"type\": \"timestamp\", \"data\": \"",0,"\"}, \"event\": {\"type\":","\"\"","","","","","","} } ] }","",""]
[null,null,null,null,null,null,null,null,null,"{","",", \"actions\": [{\"trigger\": {\"type\": \"timestamp\", \"data\": \"",0,"\"}, \"event\": {\"type\":","\"\"","","","","","","} } ] }","",""]
[null,null,null,null,null,null,null,null,null,"{","",", \"actions\": [{\"trigger\": {\"type\": \"timestamp\", \"data\": \"",0,"\"}, \"event\": {\"type\":","\"\"","","","","","","} } ] }","",""]
[null,null,null,null,null,null,null,null,null,"{","",", \"actions\": [{\"trigger\": {\"type\": \"timestamp\", \"data\": \"",0,"\"}, \"event\": {\"type\":","\"\"","","","","","","} } ] }","",""]
[null,null,null,null,null,null,null,null,null,"{","",", \"actions\": [{\"trigger\": {\"type\": \"timestamp\", \"data\": \"",0,"\"}, \"event\": {\"type\":","\"\"","","","","","","} } ] }","",""]
[null,null,null,null,null,null,null,null,null,"{","",", \"actions\": [{\"trigger\": {\"type\": \"timestamp\", \"data\": \"",0,"\"}, \"event\": {\"type\":","\"\"","","","","","","} } ] }","",""]
[null,null,null,null,null,null,null,null,null,"{","",", \"actions\": [{\"trigger\": {\"type\": \"timestamp\", \"data\": \"",0,"\"}, \"event\": {\"type\":","\"\"","","","","","","} } ] }","",""]
[null,null,null,null,null,null,null,null,null,"{","",", \"actions\": [{\"trigger\": {\"type\": \"timestamp\", \"data\": \"",0,"\"}, \"event\": {\"type\":","\"\"","","","","","","} } ] }","",""]
[null,null,null,null,null,null,null,null,null,"{","",", \"actions\": [{\"trigger\": {\"type\": \"timestamp\", \"data\": \"",0,"\"}, \"event\": {\"type\":","\"\"","","","","","","} } ] }","",""]
[null,null,null,null,null,null,null,null,null,"{","",", \"actions\": [{\"trigger\": {\"type\": \"timestamp\", \"data\": \"",0,"\"}, \"event\": {\"type\":","\"\"","","","","","","} } ] }","",""]
[null,null,null,null,null,null,null,null,null,"{","",", \"actions\": [{\"trigger\": {\"type\": \"timestamp\", \"data\": \"",0,"\"}, \"event\": {\"type\":","\"\"","","","","","","} } ] }","",""]
[null,null,null,null,null,null,null,null,null,"{","",", \"actions\": [{\"trigger\": {\"type\": \"timestamp\", \"data\": \"",0,"\"}, \"event\": {\"type\":","\"\"","","","","","","} } ] }","",""]
[null,null,null,null,null,null,null,null,null,"{","",", \"actions\": [{\"trigger\": {\"type\": \"timestamp\", \"data\": \"",0,"\"}, \"event\": {\"type\":","\"\"","","","","","","} } ] }","",""]
[null,null,null,null,null,null,null,null,null,"{","",", \"actions\": [{\"trigger\": {\"type\": \"timestamp\", \"data\": \"",0,"\"}, \"event\": {\"type\":","\"\"","","","","","","} } ] }","",""]
[null,null,null,null,null,null,null,null,null,"{","",", \"actions\": [{\"trigger\": {\"type\": \"timestamp\", \"data\": \"",0,"\"}, \"event\": {\"type\":","\"\"","","","","","","} } ] }","",""]
[null,null,null,null,null,null,null,null,null,"{","",", \"actions\": [{\"trigger\": {\"type\": \"timestamp\", \"data\": \"",0,"\"}, \"event\": {\"type\":","\"\"","","","","","","} } ] }","",""]
[null,null,null,null,null,null,null,null,null,"{","",", \"actions\": [{\"trigger\": {\"type\": \"timestamp\", \"data\": \"",0,"\"}, \"event\": {\"type\":","\"\"","","","","","","} } ] }","",""]
[null,null,null,null,null,null,null,null,null,"{","",", \"actions\": [{\"trigger\": {\"type\": \"timestamp\", \"data\": \"",0,"\"}, \"event\": {\"type\":","\"\"","","","","","","} } ] }","",""]
[null,null,null,null,null,null,null,null,null,"{","",", \"actions\": [{\"trigger\": {\"type\": \"timestamp\", \"data\": \"",0,"\"}, \"event\": {\"type\":","\"\"","","","","","","} } ] }","",""]
[null,null,null,null,null,null,null,null,null,"{","",", \"actions\": [{\"trigger\": {\"type\": \"timestamp\", \"data\": \"",0,"\"}, \"event\": {\"type\":","\"\"","","","","","","} } ] }","",""]
[null,null,null,null,null,null,null,null,null,"{","",", \"actions\": [{\"trigger\": {\"type\": \"timestamp\", \"data\": \"",0,"\"}, \"event\": {\"type\":","\"\"","","","","","","} } ] }","",""]
[null,null,null,null,null,null,null,null,null,"{","",", \"actions\": [{\"trigger\": {\"type\": \"timestamp\", \"data\": \"",0,"\"}, \"event\": {\"type\":","\"\"","","","","","","} } ] }","",""]
[null,null,null,null,null,null,null,null,null,"{","",", \"actions\": [{\"trigger\": {\"type\": \"timestamp\", \"data\": \"",0,"\"}, \"event\": {\"type\":","\"\"","","","","","","} } ] }","",""]
[null,null,null,null,null,null,null,null,null,"{","",", \"actions\": [{\"trigger\": {\"type\": \"timestamp\", \"data\": \"",0,"\"}, \"event\": {\"type\":","\"\"","","","","","","} } ] }","",""]
[null,null,null,null,null,null,null,null,null,"{","",", \"actions\": [{\"trigger\": {\"type\": \"timestamp\", \"data\": \"",0,"\"}, \"event\": {\"type\":","\"\"","","","","","","} } ] }","",""]
[null,null,null,null,null,null,null,null,null,"{","",", \"actions\": [{\"trigger\": {\"type\": \"timestamp\", \"data\": \"",0,"\"}, \"event\": {\"type\":","\"\"","","","","","","} } ] }","",""]
[null,null,null,null,null,null,null,null,null,"{",{"$f":"IF(A1103<>\"\",CONCATENATE(\"\"\"\",A$3,\"\"\": \"\"\",$B$1,A1103,\"\"\"\"),\"\")","v":""},", \"actions\": [{\"trigger\": {\"type\": \"timestamp\", \"data\": \"",{"$f":"B1103*1000","v":0},"\"}, \"event\": {\"type\":",{"$f":"CONCATENATE(\"\"\"\",C1103,\"\"\"\")","v":"\"\""},{"$f":"IF(D1103<>\"\",CONCATENATE(\",\"\"\",D$3,\"\"\": \"\"\",D1103,\"\"\"\"),\"\")","v":""},{"$f":"IF(E1103<>\"\",CONCATENATE(\",\"\"\",E$3,\"\"\": \"\"\",E1103,\"\"\"\"),\"\")","v":""},{"$f":"IF(F1103<>\"\",CONCATENATE(\",\"\"\",F$3,\"\"\": \",F1103),\"\")","v":""},{"$f":"IF(G1103<>\"\",CONCATENATE(\",\"\"\",G$3,\"\"\": \",G1103),\"\")","v":""},{"$f":"IF(H1103<>\"\",CONCATENATE(\",\"\"\",H$3,\"\"\": \"\"\",H1103,\"\"\"\"),\"\")","v":""},"} } ] }",{"$f":"IF(A1103<>\"\",CONCATENATE(J1103,K1103,L1103,M1103,N1103,O1103,P1103,Q1103,R1103,S1103,T1103,U1103),\"\")","v":""},{"$f":"CONCATENATE(IF(AND(W1102<>\"\",X1102=\"\"),CONCATENATE(W1102,IF(A1103<>\"\",\",\",\"\")),\"\"),V1103)","v":""}]
[null,null,null,null,null,null,null,null,null,"{","",", \"actions\": [{\"trigger\": {\"type\": \"timestamp\", \"data\": \"",0,"\"}, \"event\": {\"type\":","\"\"","","","","","","} } ] }","",""]
[null,null,null,null,null,null,null,null,null,"{","",", \"actions\": [{\"trigger\": {\"type\": \"timestamp\", \"data\": \"",0,"\"}, \"event\": {\"type\":","\"\"","","","","","","} } ] }","",""]
[null,null,null,null,null,null,null,null,null,"{","",", \"actions\": [{\"trigger\": {\"type\": \"timestamp\", \"data\": \"",0,"\"}, \"event\": {\"type\":","\"\"","","","","","","} } ] }","",""]
[null,null,null,null,null,null,null,null,null,"{","",", \"actions\": [{\"trigger\": {\"type\": \"timestamp\", \"data\": \"",0,"\"}, \"event\": {\"type\":","\"\"","","","","","","} } ] }","",""]
[null,null,null,null,null,null,null,null,null,"{","",", \"actions\": [{\"trigger\": {\"type\": \"timestamp\", \"data\": \"",0,"\"}, \"event\": {\"type\":","\"\"","","","","","","} } ] }","",""]
[null,null,null,null,null,null,null,null,null,"{","",", \"actions\": [{\"trigger\": {\"type\": \"timestamp\", \"data\": \"",0,"\"}, \"event\": {\"type\":","\"\"","","","","","","} } ] }","",""]
[null,null,null,null,null,null,null,null,null,"{","",", \"actions\": [{\"trigger\": {\"type\": \"timestamp\", \"data\": \"",0,"\"}, \"event\": {\"type\":","\"\"","","","","","","} } ] }","",""]
[null,null,null,null,null,null,null,null,null,"{","",", \"actions\": [{\"trigger\": {\"type\": \"timestamp\", \"data\": \"",0,"\"}, \"event\": {\"type\":","\"\"","","","","","","} } ] }","",""]
[null,null,null,null,null,null,null,null,null,"{","",", \"actions\": [{\"trigger\": {\"type\": \"timestamp\", \"data\": \"",0,"\"}, \"event\": {\"type\":","\"\"","","","","","","} } ] }","",""]
[null,null,null,null,null,null,null,null,null,"{","",", \"actions\": [{\"trigger\": {\"type\": \"timestamp\", \"data\": \"",0,"\"}, \"event\": {\"type\":","\"\"","","","","","","} } ] }","",""]
[null,null,null,null,null,null,null,null,null,"{","",", \"actions\": [{\"trigger\": {\"type\": \"timestamp\", \"data\": \"",0,"\"}, \"event\": {\"type\":","\"\"","","","","","","} } ] }","",""]
[null,null,null,null,null,null,null,null,null,"{","",", \"actions\": [{\"trigger\": {\"type\": \"timestamp\", \"data\": \"",0,"\"}, \"event\": {\"type\":","\"\"","","","","","","} } ] }","",""]
[null,null,null,null,null,null,null,null,null,"{","",", \"actions\": [{\"trigger\": {\"type\": \"timestamp\", \"data\": \"",0,"\"}, \"event\": {\"type\":","\"\"","","","","","","} } ] }","",""]
[null,null,null,null,null,null,null,null,null,"{","",", \"actions\": [{\"trigger\": {\"type\": \"timestamp\", \"data\": \"",0,"\"}, \"event\": {\"type\":","\"\"","","","","","","} } ] }","",""]
[null,null,null,null,null,null,null,null,null,"{","",", \"actions\": [{\"trigger\": {\"type\": \"timestamp\", \"data\": \"",0,"\"}, \"event\": {\"type\":","\"\"","","","","","","} } ] }","",""]
[null,null,null,null,null,null,null,null,null,"{","",", \"actions\": [{\"trigger\": {\"type\": \"timestamp\", \"data\": \"",0,"\"}, \"event\": {\"type\":","\"\"","","","","","","} } ] }","",""]
[null,null,null,null,null,null,null,null,null,"{","",", \"actions\": [{\"trigger\": {\"type\": \"timestamp\", \"data\": \"",0,"\"}, \"event\": {\"type\":","\"\"","","","","","","} } ] }","",""]
[null,null,null,null,null,null,null,null,null,"{","",", \"actions\": [{\"trigger\": {\"type\": \"timestamp\", \"data\": \"",0,"\"}, \"event\": {\"type\":","\"\"","","","","","","} } ] }","",""]
[null,null,null,null,null,null,null,null,null,"{","",", \"actions\": [{\"trigger\": {\"type\": \"timestamp\", \"data\": \"",0,"\"}, \"event\": {\"type\":","\"\"","","","","","","} } ] }","",""]
[null,null,null,null,null,null,null,null,null,"{","",", \"actions\": [{\"trigger\": {\"type\": \"timestamp\", \"data\": \"",0,"\"}, \"event\": {\"type\":","\"\"","","","","","","} } ] }","",""]
[null,null,null,null,null,null,null,null,null,"{","",", \"actions\": [{\"trigger\": {\"type\": \"timestamp\", \"data\": \"",0,"\"}, \"event\": {\"type\":","\"\"","","","","","","} } ] }","",""]
[null,null,null,null,null,null,null,null,null,"{","",", \"actions\": [{\"trigger\": {\"type\": \"timestamp\", \"data\": \"",0,"\"}, \"event\": {\"type\":","\"\"","","","","","","} } ] }","",""]
[null,null,null,null,null,null,null,null,null,"{","",", \"actions\": [{\"trigger\": {\"type\": \"timestamp\", \"data\": \"",0,"\"}, \"event\": {\"type\":","\"\"","","","","","","} } ] }","",""]
[null,null,null,null,null,null,null,null,null,"{","",", \"actions\": [{\"trigger\": {\"type\": \"timestamp\", \"data\": \"",0,"\"}, \"event\": {\"type\":","\"\"","","","","","","} } ] }","",""]
[null,null,null,null,null,null,null,null,null,"{","",", \"actions\": [{\"trigger\": {\"type\": \"timestamp\", \"data\": \"",0,"\"}, \"event\": {\"type\":","\"\"","","","","","","} } ] }","",""]
[null,null,null,null,null,null,null,null,null,"{","",", \"actions\": [{\"trigger\": {\"type\": \"timestamp\", \"data\": \"",0,"\"}, \"event\": {\"type\":","\"\"","","","","","","} } ] }","",""]
[null,null,null,null,null,null,null,null,null,"{","",", \"actions\": [{\"trigger\": {\"type\": \"timestamp\", \"data\": \"",0,"\"}, \"event\": {\"type\":","\"\"","","","","","","} } ] }","",""]
[null,null,null,null,null,null,null,null,null,"{","",", \"actions\": [{\"trigger\": {\"type\": \"timestamp\", \"data\": \"",0,"\"}, \"event\": {\"type\":","\"\"","","","","","","} } ] }","",""]
[null,null,null,null,null,null,null,null,null,"{","",", \"actions\": [{\"trigger\": {\"type\": \"timestamp\", \"data\": \"",0,"\"}, \"event\": {\"type\":","\"\"","","","","","","} } ] }","",""]
[null,null,null,null,null,null,null,null,null,"{","",", \"actions\": [{\"trigger\": {\"type\": \"timestamp\", \"data\": \"",0,"\"}, \"event\": {\"type\":","\"\"","","","","","","} } ] }","",""]
[null,null,null,null,null,null,null,null,null,"{","",", \"actions\": [{\"trigger\": {\"type\": \"timestamp\", \"data\": \"",0,"\"}, \"event\": {\"type\":","\"\"","","","","","","} } ] }","",""]
[null,null,null,null,null,null,null,null,null,"{","",", \"actions\": [{\"trigger\": {\"type\": \"timestamp\", \"data\": \"",0,"\"}, \"event\": {\"type\":","\"\"","","","","","","} } ] }","",""]
[null,null,null,null,null,null,null,null,null,"{","",", \"actions\": [{\"trigger\": {\"type\": \"timestamp\", \"data\": \"",0,"\"}, \"event\": {\"type\":","\"\"","","","","","","} } ] }","",""]
[null,null,null,null,null,null,null,null,null,"{","",", \"actions\": [{\"trigger\": {\"type\": \"timestamp\", \"data\": \"",0,"\"}, \"event\": {\"type\":","\"\"","","","","","","} } ] }","",""]
[null,null,null,null,null,null,null,null,null,"{","",", \"actions\": [{\"trigger\": {\"type\": \"timestamp\", \"data\": \"",0,"\"}, \"event\": {\"type\":","\"\"","","","","","","} } ] }","",""]
[null,null,null,null,null,null,null,null,null,"{","",", \"actions\": [{\"trigger\": {\"type\": \"timestamp\", \"data\": \"",0,"\"}, \"event\": {\"type\":","\"\"","","","","","","} } ] }","",""]
[null,null,null,null,null,null,null,null,null,"{","",", \"actions\": [{\"trigger\": {\"type\": \"timestamp\", \"data\": \"",0,"\"}, \"event\": {\"type\":","\"\"","","","","","","} } ] }","",""]
[null,null,null,null,null,null,null,null,null,"{","",", \"actions\": [{\"trigger\": {\"type\": \"timestamp\", \"data\": \"",0,"\"}, \"event\": {\"type\":","\"\"","","","","","","} } ] }","",""]
[null,null,null,null,null,null,null,null,null,"{","",", \"actions\": [{\"trigger\": {\"type\": \"timestamp\", \"data\": \"",0,"\"}, \"event\": {\"type\":","\"\"","","","","","","} } ] }","",""]
[null,null,null,null,null,null,null,null,null,"{","",", \"actions\": [{\"trigger\": {\"type\": \"timestamp\", \"data\": \"",0,"\"}, \"event\": {\"type\":","\"\"","","","","","","} } ] }","",""]
[null,null,null,null,null,null,null,null,null,"{","",", \"actions\": [{\"trigger\": {\"type\": \"timestamp\", \"data\": \"",0,"\"}, \"event\": {\"type\":","\"\"","","","","","","} } ] }","",""]
[null,null,null,null,null,null,null,null,null,"{","",", \"actions\": [{\"trigger\": {\"type\": \"timestamp\", \"data\": \"",0,"\"}, \"event\": {\"type\":","\"\"","","","","","","} } ] }","",""]
[null,null,null,null,null,null,null,null,null,"{","",", \"actions\": [{\"trigger\": {\"type\": \"timestamp\", \"data\": \"",0,"\"}, \"event\": {\"type\":","\"\"","","","","","","} } ] }","",""]
[null,null,null,null,null,null,null,null,null,"{","",", \"actions\": [{\"trigger\": {\"type\": \"timestamp\", \"data\": \"",0,"\"}, \"event\": {\"type\":","\"\"","","","","","","} } ] }","",""]
[null,null,null,null,null,null,null,null,null,"{","",", \"actions\": [{\"trigger\": {\"type\": \"timestamp\", \"data\": \"",0,"\"}, \"event\": {\"type\":","\"\"","","","","","","} } ] }","",""]
[null,null,null,null,null,null,null,null,null,"{","",", \"actions\": [{\"trigger\": {\"type\": \"timestamp\", \"data\": \"",0,"\"}, \"event\": {\"type\":","\"\"","","","","","","} } ] }","",""]
[null,null,null,null,null,null,null,null,null,"{","",", \"actions\": [{\"trigger\": {\"type\": \"timestamp\", \"data\": \"",0,"\"}, \"event\": {\"type\":","\"\"","","","","","","} } ] }","",""]
[null,null,null,null,null,null,null,null,null,"{","",", \"actions\": [{\"trigger\": {\"type\": \"timestamp\", \"data\": \"",0,"\"}, \"event\": {\"type\":","\"\"","","","","","","} } ] }","",""]
[null,null,null,null,null,null,null,null,null,"{","",", \"actions\": [{\"trigger\": {\"type\": \"timestamp\", \"data\": \"",0,"\"}, \"event\": {\"type\":","\"\"","","","","","","} } ] }","",""]
[null,null,null,null,null,null,null,null,null,"{","",", \"actions\": [{\"trigger\": {\"type\": \"timestamp\", \"data\": \"",0,"\"}, \"event\": {\"type\":","\"\"","","","","","","} } ] }","",""]
[null,null,null,null,null,null,null,null,null,"{","",", \"actions\": [{\"trigger\": {\"type\": \"timestamp\", \"data\": \"",0,"\"}, \"event\": {\"type\":","\"\"","","","","","","} } ] }","",""]
[null,null,null,null,null,null,null,null,null,"{","",", \"actions\": [{\"trigger\": {\"type\": \"timestamp\", \"data\": \"",0,"\"}, \"event\": {\"type\":","\"\"","","","","","","} } ] }","",""]
[null,null,null,null,null,null,null,null,null,"{","",", \"actions\": [{\"trigger\": {\"type\": \"timestamp\", \"data\": \"",0,"\"}, \"event\": {\"type\":","\"\"","","","","","","} } ] }","",""]
[null,null,null,null,null,null,null,null,null,"{","",", \"actions\": [{\"trigger\": {\"type\": \"timestamp\", \"data\": \"",0,"\"}, \"event\": {\"type\":","\"\"","","","","","","} } ] }","",""]
[null,null,null,null,null,null,null,null,null,"{","",", \"actions\": [{\"trigger\": {\"type\": \"timestamp\", \"data\": \"",0,"\"}, \"event\": {\"type\":","\"\"","","","","","","} } ] }","",""]
[null,null,null,null,null,null,null,null,null,"{","",", \"actions\": [{\"trigger\": {\"type\": \"timestamp\", \"data\": \"",0,"\"}, \"event\": {\"type\":","\"\"","","","","","","} } ] }","",""]
[null,null,null,null,null,null,null,null,null,"{","",", \"actions\": [{\"trigger\": {\"type\": \"timestamp\", \"data\": \"",0,"\"}, \"event\": {\"type\":","\"\"","","","","","","} } ] }","",""]
[null,null,null,null,null,null,null,null,null,"{","",", \"actions\": [{\"trigger\": {\"type\": \"timestamp\", \"data\": \"",0,"\"}, \"event\": {\"type\":","\"\"","","","","","","} } ] }","",""]
[null,null,null,null,null,null,null,null,null,"{","",", \"actions\": [{\"trigger\": {\"type\": \"timestamp\", \"data\": \"",0,"\"}, \"event\": {\"type\":","\"\"","","","","","","} } ] }","",""]
[null,null,null,null,null,null,null,null,null,"{","",", \"actions\": [{\"trigger\": {\"type\": \"timestamp\", \"data\": \"",0,"\"}, \"event\": {\"type\":","\"\"","","","","","","} } ] }","",""]
[null,null,null,null,null,null,null,null,null,"{","",", \"actions\": [{\"trigger\": {\"type\": \"timestamp\", \"data\": \"",0,"\"}, \"event\": {\"type\":","\"\"","","","","","","} } ] }","",""]
[null,null,null,null,null,null,null,null,null,"{","",", \"actions\": [{\"trigger\": {\"type\": \"timestamp\", \"data\": \"",0,"\"}, \"event\": {\"type\":","\"\"","","","","","","} } ] }","",""]
[null,null,null,null,null,null,null,null,null,"{","",", \"actions\": [{\"trigger\": {\"type\": \"timestamp\", \"data\": \"",0,"\"}, \"event\": {\"type\":","\"\"","","","","","","} } ] }","",""]
[null,null,null,null,null,null,null,null,null,"{",{"$f":"IF(A1167<>\"\",CONCATENATE(\"\"\"\",A$3,\"\"\": \"\"\",$B$1,A1167,\"\"\"\"),\"\")","v":""},", \"actions\": [{\"trigger\": {\"type\": \"timestamp\", \"data\": \"",{"$f":"B1167*1000","v":0},"\"}, \"event\": {\"type\":",{"$f":"CONCATENATE(\"\"\"\",C1167,\"\"\"\")","v":"\"\""},{"$f":"IF(D1167<>\"\",CONCATENATE(\",\"\"\",D$3,\"\"\": \"\"\",D1167,\"\"\"\"),\"\")","v":""},{"$f":"IF(E1167<>\"\",CONCATENATE(\",\"\"\",E$3,\"\"\": \"\"\",E1167,\"\"\"\"),\"\")","v":""},{"$f":"IF(F1167<>\"\",CONCATENATE(\",\"\"\",F$3,\"\"\": \",F1167),\"\")","v":""},{"$f":"IF(G1167<>\"\",CONCATENATE(\",\"\"\",G$3,\"\"\": \",G1167),\"\")","v":""},{"$f":"IF(H1167<>\"\",CONCATENATE(\",\"\"\",H$3,\"\"\": \"\"\",H1167,\"\"\"\"),\"\")","v":""},"} } ] }",{"$f":"IF(A1167<>\"\",CONCATENATE(J1167,K1167,L1167,M1167,N1167,O1167,P1167,Q1167,R1167,S1167,T1167,U1167),\"\")","v":""},{"$f":"CONCATENATE(IF(AND(W1166<>\"\",X1166=\"\"),CONCATENATE(W1166,IF(A1167<>\"\",\",\",\"\")),\"\"),V1167)","v":""}]
[null,null,null,null,null,null,null,null,null,"{","",", \"actions\": [{\"trigger\": {\"type\": \"timestamp\", \"data\": \"",0,"\"}, \"event\": {\"type\":","\"\"","","","","","","} } ] }","",""]
[null,null,null,null,null,null,null,null,null,"{","",", \"actions\": [{\"trigger\": {\"type\": \"timestamp\", \"data\": \"",0,"\"}, \"event\": {\"type\":","\"\"","","","","","","} } ] }","",""]
[null,null,null,null,null,null,null,null,null,"{","",", \"actions\": [{\"trigger\": {\"type\": \"timestamp\", \"data\": \"",0,"\"}, \"event\": {\"type\":","\"\"","","","","","","} } ] }","",""]
[null,null,null,null,null,null,null,null,null,"{","",", \"actions\": [{\"trigger\": {\"type\": \"timestamp\", \"data\": \"",0,"\"}, \"event\": {\"type\":","\"\"","","","","","","} } ] }","",""]
[null,null,null,null,null,null,null,null,null,"{","",", \"actions\": [{\"trigger\": {\"type\": \"timestamp\", \"data\": \"",0,"\"}, \"event\": {\"type\":","\"\"","","","","","","} } ] }","",""]
[null,null,null,null,null,null,null,null,null,"{","",", \"actions\": [{\"trigger\": {\"type\": \"timestamp\", \"data\": \"",0,"\"}, \"event\": {\"type\":","\"\"","","","","","","} } ] }","",""]
[null,null,null,null,null,null,null,null,null,"{","",", \"actions\": [{\"trigger\": {\"type\": \"timestamp\", \"data\": \"",0,"\"}, \"event\": {\"type\":","\"\"","","","","","","} } ] }","",""]
[null,null,null,null,null,null,null,null,null,"{","",", \"actions\": [{\"trigger\": {\"type\": \"timestamp\", \"data\": \"",0,"\"}, \"event\": {\"type\":","\"\"","","","","","","} } ] }","",""]
[null,null,null,null,null,null,null,null,null,"{","",", \"actions\": [{\"trigger\": {\"type\": \"timestamp\", \"data\": \"",0,"\"}, \"event\": {\"type\":","\"\"","","","","","","} } ] }","",""]
[null,null,null,null,null,null,null,null,null,"{","",", \"actions\": [{\"trigger\": {\"type\": \"timestamp\", \"data\": \"",0,"\"}, \"event\": {\"type\":","\"\"","","","","","","} } ] }","",""]
[null,null,null,null,null,null,null,null,null,"{","",", \"actions\": [{\"trigger\": {\"type\": \"timestamp\", \"data\": \"",0,"\"}, \"event\": {\"type\":","\"\"","","","","","","} } ] }","",""]
[null,null,null,null,null,null,null,null,null,"{","",", \"actions\": [{\"trigger\": {\"type\": \"timestamp\", \"data\": \"",0,"\"}, \"event\": {\"type\":","\"\"","","","","","","} } ] }","",""]
[null,null,null,null,null,null,null,null,null,"{","",", \"actions\": [{\"trigger\": {\"type\": \"timestamp\", \"data\": \"",0,"\"}, \"event\": {\"type\":","\"\"","","","","","","} } ] }","",""]
[null,null,null,null,null,null,null,null,null,"{","",", \"actions\": [{\"trigger\": {\"type\": \"timestamp\", \"data\": \"",0,"\"}, \"event\": {\"type\":","\"\"","","","","","","} } ] }","",""]
[null,null,null,null,null,null,null,null,null,"{","",", \"actions\": [{\"trigger\": {\"type\": \"timestamp\", \"data\": \"",0,"\"}, \"event\": {\"type\":","\"\"","","","","","","} } ] }","",""]
[null,null,null,null,null,null,null,null,null,"{","",", \"actions\": [{\"trigger\": {\"type\": \"timestamp\", \"data\": \"",0,"\"}, \"event\": {\"type\":","\"\"","","","","","","} } ] }","",""]
[null,null,null,null,null,null,null,null,null,"{","",", \"actions\": [{\"trigger\": {\"type\": \"timestamp\", \"data\": \"",0,"\"}, \"event\": {\"type\":","\"\"","","","","","","} } ] }","",""]
[null,null,null,null,null,null,null,null,null,"{","",", \"actions\": [{\"trigger\": {\"type\": \"timestamp\", \"data\": \"",0,"\"}, \"event\": {\"type\":","\"\"","","","","","","} } ] }","",""]
[null,null,null,null,null,null,null,null,null,"{","",", \"actions\": [{\"trigger\": {\"type\": \"timestamp\", \"data\": \"",0,"\"}, \"event\": {\"type\":","\"\"","","","","","","} } ] }","",""]
[null,null,null,null,null,null,null,null,null,"{","",", \"actions\": [{\"trigger\": {\"type\": \"timestamp\", \"data\": \"",0,"\"}, \"event\": {\"type\":","\"\"","","","","","","} } ] }","",""]
[null,null,null,null,null,null,null,null,null,"{","",", \"actions\": [{\"trigger\": {\"type\": \"timestamp\", \"data\": \"",0,"\"}, \"event\": {\"type\":","\"\"","","","","","","} } ] }","",""]
[null,null,null,null,null,null,null,null,null,"{","",", \"actions\": [{\"trigger\": {\"type\": \"timestamp\", \"data\": \"",0,"\"}, \"event\": {\"type\":","\"\"","","","","","","} } ] }","",""]
[null,null,null,null,null,null,null,null,null,"{","",", \"actions\": [{\"trigger\": {\"type\": \"timestamp\", \"data\": \"",0,"\"}, \"event\": {\"type\":","\"\"","","","","","","} } ] }","",""]
[null,null,null,null,null,null,null,null,null,"{","",", \"actions\": [{\"trigger\": {\"type\": \"timestamp\", \"data\": \"",0,"\"}, \"event\": {\"type\":","\"\"","","","","","","} } ] }","",""]
[null,null,null,null,null,null,null,null,null,"{","",", \"actions\": [{\"trigger\": {\"type\": \"timestamp\", \"data\": \"",0,"\"}, \"event\": {\"type\":","\"\"","","","","","","} } ] }","",""]
[null,null,null,null,null,null,null,null,null,"{","",", \"actions\": [{\"trigger\": {\"type\": \"timestamp\", \"data\": \"",0,"\"}, \"event\": {\"type\":","\"\"","","","","","","} } ] }","",""]
[null,null,null,null,null,null,null,null,null,"{","",", \"actions\": [{\"trigger\": {\"type\": \"timestamp\", \"data\": \"",0,"\"}, \"event\": {\"type\":","\"\"","","","","","","} } ] }","",""]
[null,null,null,null,null,null,null,null,null,"{","",", \"actions\": [{\"trigger\": {\"type\": \"timestamp\", \"data\": \"",0,"\"}, \"event\": {\"type\":","\"\"","","","","","","} } ] }","",""]
[null,null,null,null,null,null,null,null,null,"{","",", \"actions\": [{\"trigger\": {\"type\": \"timestamp\", \"data\": \"",0,"\"}, \"event\": {\"type\":","\"\"","","","","","","} } ] }","",""]
[null,null,null,null,null,null,null,null,null,"{","",", \"actions\": [{\"trigger\": {\"type\": \"timestamp\", \"data\": \"",0,"\"}, \"event\": {\"type\":","\"\"","","","","","","} } ] }","",""]
[null,null,null,null,null,null,null,null,null,"{","",", \"actions\": [{\"trigger\": {\"type\": \"timestamp\", \"data\": \"",0,"\"}, \"event\": {\"type\":","\"\"","","","","","","} } ] }","",""]
[null,null,null,null,null,null,null,null,null,"{","",", \"actions\": [{\"trigger\": {\"type\": \"timestamp\", \"data\": \"",0,"\"}, \"event\": {\"type\":","\"\"","","","","","","} } ] }","",""]
[null,null,null,null,null,null,null,null,null,"{","",", \"actions\": [{\"trigger\": {\"type\": \"timestamp\", \"data\": \"",0,"\"}, \"event\": {\"type\":","\"\"","","","","","","} } ] }","",""]
[null,null,null,null,null,null,null,null,null,"{","",", \"actions\": [{\"trigger\": {\"type\": \"timestamp\", \"data\": \"",0,"\"}, \"event\": {\"type\":","\"\"","","","","","","} } ] }","",""]
[null,null,null,null,null,null,null,null,null,"{","",", \"actions\": [{\"trigger\": {\"type\": \"timestamp\", \"data\": \"",0,"\"}, \"event\": {\"type\":","\"\"","","","","","","} } ] }","",""]
[null,null,null,null,null,null,null,null,null,"{","",", \"actions\": [{\"trigger\": {\"type\": \"timestamp\", \"data\": \"",0,"\"}, \"event\": {\"type\":","\"\"","","","","","","} } ] }","",""]
[null,null,null,null,null,null,null,null,null,"{","",", \"actions\": [{\"trigger\": {\"type\": \"timestamp\", \"data\": \"",0,"\"}, \"event\": {\"type\":","\"\"","","","","","","} } ] }","",""]
[null,null,null,null,null,null,null,null,null,"{","",", \"actions\": [{\"trigger\": {\"type\": \"timestamp\", \"data\": \"",0,"\"}, \"event\": {\"type\":","\"\"","","","","","","} } ] }","",""]
[null,null,null,null,null,null,null,null,null,"{","",", \"actions\": [{\"trigger\": {\"type\": \"timestamp\", \"data\": \"",0,"\"}, \"event\": {\"type\":","\"\"","","","","","","} } ] }","",""]
[null,null,null,null,null,null,null,null,null,"{","",", \"actions\": [{\"trigger\": {\"type\": \"timestamp\", \"data\": \"",0,"\"}, \"event\": {\"type\":","\"\"","","","","","","} } ] }","",""]
[null,null,null,null,null,null,null,null,null,"{","",", \"actions\": [{\"trigger\": {\"type\": \"timestamp\", \"data\": \"",0,"\"}, \"event\": {\"type\":","\"\"","","","","","","} } ] }","",""]
[null,null,null,null,null,null,null,null,null,"{","",", \"actions\": [{\"trigger\": {\"type\": \"timestamp\", \"data\": \"",0,"\"}, \"event\": {\"type\":","\"\"","","","","","","} } ] }","",""]
[null,null,null,null,null,null,null,null,null,"{","",", \"actions\": [{\"trigger\": {\"type\": \"timestamp\", \"data\": \"",0,"\"}, \"event\": {\"type\":","\"\"","","","","","","} } ] }","",""]
[null,null,null,null,null,null,null,null,null,"{","",", \"actions\": [{\"trigger\": {\"type\": \"timestamp\", \"data\": \"",0,"\"}, \"event\": {\"type\":","\"\"","","","","","","} } ] }","",""]
[null,null,null,null,null,null,null,null,null,"{","",", \"actions\": [{\"trigger\": {\"type\": \"timestamp\", \"data\": \"",0,"\"}, \"event\": {\"type\":","\"\"","","","","","","} } ] }","",""]
[null,null,null,null,null,null,null,null,null,"{","",", \"actions\": [{\"trigger\": {\"type\": \"timestamp\", \"data\": \"",0,"\"}, \"event\": {\"type\":","\"\"","","","","","","} } ] }","",""]
[null,null,null,null,null,null,null,null,null,"{","",", \"actions\": [{\"trigger\": {\"type\": \"timestamp\", \"data\": \"",0,"\"}, \"event\": {\"type\":","\"\"","","","","","","} } ] }","",""]
[null,null,null,null,null,null,null,null,null,"{","",", \"actions\": [{\"trigger\": {\"type\": \"timestamp\", \"data\": \"",0,"\"}, \"event\": {\"type\":","\"\"","","","","","","} } ] }","",""]
[null,null,null,null,null,null,null,null,null,"{","",", \"actions\": [{\"trigger\": {\"type\": \"timestamp\", \"data\": \"",0,"\"}, \"event\": {\"type\":","\"\"","","","","","","} } ] }","",""]
[null,null,null,null,null,null,null,null,null,"{","",", \"actions\": [{\"trigger\": {\"type\": \"timestamp\", \"data\": \"",0,"\"}, \"event\": {\"type\":","\"\"","","","","","","} } ] }","",""]
[null,null,null,null,null,null,null,null,null,"{","",", \"actions\": [{\"trigger\": {\"type\": \"timestamp\", \"data\": \"",0,"\"}, \"event\": {\"type\":","\"\"","","","","","","} } ] }","",""]
[null,null,null,null,null,null,null,null,null,"{","",", \"actions\": [{\"trigger\": {\"type\": \"timestamp\", \"data\": \"",0,"\"}, \"event\": {\"type\":","\"\"","","","","","","} } ] }","",""]
[null,null,null,null,null,null,null,null,null,"{","",", \"actions\": [{\"trigger\": {\"type\": \"timestamp\", \"data\": \"",0,"\"}, \"event\": {\"type\":","\"\"","","","","","","} } ] }","",""]
[null,null,null,null,null,null,null,null,null,"{","",", \"actions\": [{\"trigger\": {\"type\": \"timestamp\", \"data\": \"",0,"\"}, \"event\": {\"type\":","\"\"","","","","","","} } ] }","",""]
[null,null,null,null,null,null,null,null,null,"{","",", \"actions\": [{\"trigger\": {\"type\": \"timestamp\", \"data\": \"",0,"\"}, \"event\": {\"type\":","\"\"","","","","","","} } ] }","",""]
[null,null,null,null,null,null,null,null,null,"{","",", \"actions\": [{\"trigger\": {\"type\": \"timestamp\", \"data\": \"",0,"\"}, \"event\": {\"type\":","\"\"","","","","","","} } ] }","",""]
[null,null,null,null,null,null,null,null,null,"{","",", \"actions\": [{\"trigger\": {\"type\": \"timestamp\", \"data\": \"",0,"\"}, \"event\": {\"type\":","\"\"","","","","","","} } ] }","",""]
[null,null,null,null,null,null,null,null,null,"{","",", \"actions\": [{\"trigger\": {\"type\": \"timestamp\", \"data\": \"",0,"\"}, \"event\": {\"type\":","\"\"","","","","","","} } ] }","",""]
[null,null,null,null,null,null,null,null,null,"{","",", \"actions\": [{\"trigger\": {\"type\": \"timestamp\", \"data\": \"",0,"\"}, \"event\": {\"type\":","\"\"","","","","","","} } ] }","",""]
[null,null,null,null,null,null,null,null,null,"{","",", \"actions\": [{\"trigger\": {\"type\": \"timestamp\", \"data\": \"",0,"\"}, \"event\": {\"type\":","\"\"","","","","","","} } ] }","",""]
[null,null,null,null,null,null,null,null,null,"{","",", \"actions\": [{\"trigger\": {\"type\": \"timestamp\", \"data\": \"",0,"\"}, \"event\": {\"type\":","\"\"","","","","","","} } ] }","",""]
[null,null,null,null,null,null,null,null,null,"{","",", \"actions\": [{\"trigger\": {\"type\": \"timestamp\", \"data\": \"",0,"\"}, \"event\": {\"type\":","\"\"","","","","","","} } ] }","",""]
[null,null,null,null,null,null,null,null,null,"{","",", \"actions\": [{\"trigger\": {\"type\": \"timestamp\", \"data\": \"",0,"\"}, \"event\": {\"type\":","\"\"","","","","","","} } ] }","",""]
[null,null,null,null,null,null,null,null,null,"{",{"$f":"IF(A1231<>\"\",CONCATENATE(\"\"\"\",A$3,\"\"\": \"\"\",$B$1,A1231,\"\"\"\"),\"\")","v":""},", \"actions\": [{\"trigger\": {\"type\": \"timestamp\", \"data\": \"",{"$f":"B1231*1000","v":0},"\"}, \"event\": {\"type\":",{"$f":"CONCATENATE(\"\"\"\",C1231,\"\"\"\")","v":"\"\""},{"$f":"IF(D1231<>\"\",CONCATENATE(\",\"\"\",D$3,\"\"\": \"\"\",D1231,\"\"\"\"),\"\")","v":""},{"$f":"IF(E1231<>\"\",CONCATENATE(\",\"\"\",E$3,\"\"\": \"\"\",E1231,\"\"\"\"),\"\")","v":""},{"$f":"IF(F1231<>\"\",CONCATENATE(\",\"\"\",F$3,\"\"\": \",F1231),\"\")","v":""},{"$f":"IF(G1231<>\"\",CONCATENATE(\",\"\"\",G$3,\"\"\": \",G1231),\"\")","v":""},{"$f":"IF(H1231<>\"\",CONCATENATE(\",\"\"\",H$3,\"\"\": \"\"\",H1231,\"\"\"\"),\"\")","v":""},"} } ] }",{"$f":"IF(A1231<>\"\",CONCATENATE(J1231,K1231,L1231,M1231,N1231,O1231,P1231,Q1231,R1231,S1231,T1231,U1231),\"\")","v":""},{"$f":"CONCATENATE(IF(AND(W1230<>\"\",X1230=\"\"),CONCATENATE(W1230,IF(A1231<>\"\",\",\",\"\")),\"\"),V1231)","v":""}]
[null,null,null,null,null,null,null,null,null,"{","",", \"actions\": [{\"trigger\": {\"type\": \"timestamp\", \"data\": \"",0,"\"}, \"event\": {\"type\":","\"\"","","","","","","} } ] }","",""]
[null,null,null,null,null,null,null,null,null,"{","",", \"actions\": [{\"trigger\": {\"type\": \"timestamp\", \"data\": \"",0,"\"}, \"event\": {\"type\":","\"\"","","","","","","} } ] }","",""]
[null,null,null,null,null,null,null,null,null,"{","",", \"actions\": [{\"trigger\": {\"type\": \"timestamp\", \"data\": \"",0,"\"}, \"event\": {\"type\":","\"\"","","","","","","} } ] }","",""]
[null,null,null,null,null,null,null,null,null,"{","",", \"actions\": [{\"trigger\": {\"type\": \"timestamp\", \"data\": \"",0,"\"}, \"event\": {\"type\":","\"\"","","","","","","} } ] }","",""]
[null,null,null,null,null,null,null,null,null,"{","",", \"actions\": [{\"trigger\": {\"type\": \"timestamp\", \"data\": \"",0,"\"}, \"event\": {\"type\":","\"\"","","","","","","} } ] }","",""]
[null,null,null,null,null,null,null,null,null,"{","",", \"actions\": [{\"trigger\": {\"type\": \"timestamp\", \"data\": \"",0,"\"}, \"event\": {\"type\":","\"\"","","","","","","} } ] }","",""]
[null,null,null,null,null,null,null,null,null,"{","",", \"actions\": [{\"trigger\": {\"type\": \"timestamp\", \"data\": \"",0,"\"}, \"event\": {\"type\":","\"\"","","","","","","} } ] }","",""]
[null,null,null,null,null,null,null,null,null,"{","",", \"actions\": [{\"trigger\": {\"type\": \"timestamp\", \"data\": \"",0,"\"}, \"event\": {\"type\":","\"\"","","","","","","} } ] }","",""]
[null,null,null,null,null,null,null,null,null,"{","",", \"actions\": [{\"trigger\": {\"type\": \"timestamp\", \"data\": \"",0,"\"}, \"event\": {\"type\":","\"\"","","","","","","} } ] }","",""]
[null,null,null,null,null,null,null,null,null,"{","",", \"actions\": [{\"trigger\": {\"type\": \"timestamp\", \"data\": \"",0,"\"}, \"event\": {\"type\":","\"\"","","","","","","} } ] }","",""]
[null,null,null,null,null,null,null,null,null,"{","",", \"actions\": [{\"trigger\": {\"type\": \"timestamp\", \"data\": \"",0,"\"}, \"event\": {\"type\":","\"\"","","","","","","} } ] }","",""]
[null,null,null,null,null,null,null,null,null,"{","",", \"actions\": [{\"trigger\": {\"type\": \"timestamp\", \"data\": \"",0,"\"}, \"event\": {\"type\":","\"\"","","","","","","} } ] }","",""]
[null,null,null,null,null,null,null,null,null,"{","",", \"actions\": [{\"trigger\": {\"type\": \"timestamp\", \"data\": \"",0,"\"}, \"event\": {\"type\":","\"\"","","","","","","} } ] }","",""]
[null,null,null,null,null,null,null,null,null,"{","",", \"actions\": [{\"trigger\": {\"type\": \"timestamp\", \"data\": \"",0,"\"}, \"event\": {\"type\":","\"\"","","","","","","} } ] }","",""]
[null,null,null,null,null,null,null,null,null,"{","",", \"actions\": [{\"trigger\": {\"type\": \"timestamp\", \"data\": \"",0,"\"}, \"event\": {\"type\":","\"\"","","","","","","} } ] }","",""]
[null,null,null,null,null,null,null,null,null,"{","",", \"actions\": [{\"trigger\": {\"type\": \"timestamp\", \"data\": \"",0,"\"}, \"event\": {\"type\":","\"\"","","","","","","} } ] }","",""]
[null,null,null,null,null,null,null,null,null,"{","",", \"actions\": [{\"trigger\": {\"type\": \"timestamp\", \"data\": \"",0,"\"}, \"event\": {\"type\":","\"\"","","","","","","} } ] }","","",6]

{"sheet":"Sequences","index":3,"n_rows":1248,"n_cols":17,"rows_kept":1248,"cut":false,"hidden":false,"merged":[]}
[{"$f":"Anim!$E$1","v":"{\"context\": { \"assetTrail\": false, \"UnitOfMeasureScale\": 0.01,\"Zup\": false, \"RepoAnim\": \"\"}, \"nodes\": [], \"sequences\": [], \"bookmarks\": []}"}," ",null,{"$f":"P148","v":""}," "]
[]
["id","FPS","pos","rot"," "]
[null,null,null,null," ","{",{"$f":"IF(A4<>\"\",CONCATENATE(\"\"\"\",A$3,\"\"\": \"\"\",A4,\"\"\", \"),\"\")","v":""},"\"FPS\":",{"$f":"CONCATENATE(\"\"\"\",B4,\"\"\"\",\",\")","v":"\"\","},"\"pos\":",{"$f":"CONCATENATE(\"[\",C4,\"]\",\",\")","v":"[],"},"\"rot\":",{"$f":"CONCATENATE(\"[\",D4,\"]\")","v":"[]"},"} ",{"$f":"IF(A4<>\"\",CONCATENATE(F4,G4,H4,I4,J4,K4,L4,M4,N4),\"\")","v":""},{"$f":"CONCATENATE(IF(AND(P3<>\"\",Q3=\"\"),CONCATENATE(P3,IF(A4<>\"\",\",\",\"\")),\"\"),O4)","v":""}]
[null,null,null,null," ","{",{"$f":"IF(A5<>\"\",CONCATENATE(\"\"\"\",A$3,\"\"\": \"\"\",A5,\"\"\", \"),\"\")","v":""},"\"FPS\":",{"$f":"CONCATENATE(\"\"\"\",B5,\"\"\"\",\",\")","v":"\"\","},"\"pos\":",{"$f":"CONCATENATE(\"[\",C5,\"]\",\",\")","v":"[],"},"\"rot\":",{"$f":"CONCATENATE(\"[\",D5,\"]\")","v":"[]"},"} ",{"$f":"IF(A5<>\"\",CONCATENATE(F5,G5,H5,I5,J5,K5,L5,M5,N5),\"\")","v":""},{"$f":"CONCATENATE(IF(AND(P4<>\"\",Q4=\"\"),CONCATENATE(P4,IF(A5<>\"\",\",\",\"\")),\"\"),O5)","v":""}]
[null,null,null,null," ","{","","\"FPS\":","\"\",","\"pos\":","[],","\"rot\":","[]","} ","",""]
[null,null,null,null," ","{","","\"FPS\":","\"\",","\"pos\":","[],","\"rot\":","[]","} ","",""]
[null,null,null,null," ","{","","\"FPS\":","\"\",","\"pos\":","[],","\"rot\":","[]","} ","",""]
[null,null,null,null," ","{","","\"FPS\":","\"\",","\"pos\":","[],","\"rot\":","[]","} ","",""]
[null,null,null,null," ","{","","\"FPS\":","\"\",","\"pos\":","[],","\"rot\":","[]","} ","",""]
[null,null,null,null," ","{","","\"FPS\":","\"\",","\"pos\":","[],","\"rot\":","[]","} ","",""]
[null,null,null,null," ","{","","\"FPS\":","\"\",","\"pos\":","[],","\"rot\":","[]","} ","",""]
[null,null,null,null," ","{","","\"FPS\":","\"\",","\"pos\":","[],","\"rot\":","[]","} ","",""]
[null,null,null,null," ","{","","\"FPS\":","\"\",","\"pos\":","[],","\"rot\":","[]","} ","",""]
[null,null,null,null," ","{","","\"FPS\":","\"\",","\"pos\":","[],","\"rot\":","[]","} ","",""]
[null,null,null,null," ","{","","\"FPS\":","\"\",","\"pos\":","[],","\"rot\":","[]","} ","",""]
[null,null,null,null," ","{","","\"FPS\":","\"\",","\"pos\":","[],","\"rot\":","[]","} ","",""]
[null,null,null,null," ","{","","\"FPS\":","\"\",","\"pos\":","[],","\"rot\":","[]","} ","",""]
[null,null,null,null," ","{","","\"FPS\":","\"\",","\"pos\":","[],","\"rot\":","[]","} ","",""]
[null,null,null,null," ","{","","\"FPS\":","\"\",","\"pos\":","[],","\"rot\":","[]","} ","",""]
[null,null,null,null," ","{","","\"FPS\":","\"\",","\"pos\":","[],","\"rot\":","[]","} ","",""]
[null,null,null,null," ","{","","\"FPS\":","\"\",","\"pos\":","[],","\"rot\":","[]","} ","",""]
[null,null,null,null," ","{","","\"FPS\":","\"\",","\"pos\":","[],","\"rot\":","[]","} ","",""]
[null,null,null,null," ","{","","\"FPS\":","\"\",","\"pos\":","[],","\"rot\":","[]","} ","",""]
[null,null,null,null," ","{","","\"FPS\":","\"\",","\"pos\":","[],","\"rot\":","[]","} ","",""]
[null,null,null,null," ","{","","\"FPS\":","\"\",","\"pos\":","[],","\"rot\":","[]","} ","",""]
[null,null,null,null," ","{","","\"FPS\":","\"\",","\"pos\":","[],","\"rot\":","[]","} ","",""]
[null,null,null,null," ","{","","\"FPS\":","\"\",","\"pos\":","[],","\"rot\":","[]","} ","",""]
[null,null,null,null," ","{","","\"FPS\":","\"\",","\"pos\":","[],","\"rot\":","[]","} ","",""]
[null,null,null,null," ","{","","\"FPS\":","\"\",","\"pos\":","[],","\"rot\":","[]","} ","",""]
[null,null,null,null," ","{","","\"FPS\":","\"\",","\"pos\":","[],","\"rot\":","[]","} ","",""]
[null,null,null,null," ","{","","\"FPS\":","\"\",","\"pos\":","[],","\"rot\":","[]","} ","",""]
[null,null,null,null," ","{","","\"FPS\":","\"\",","\"pos\":","[],","\"rot\":","[]","} ","",""]
[null,null,null,null," ","{","","\"FPS\":","\"\",","\"pos\":","[],","\"rot\":","[]","} ","",""]
[null,null,null,null," ","{","","\"FPS\":","\"\",","\"pos\":","[],","\"rot\":","[]","} ","",""]
[null,null,null,null," ","{","","\"FPS\":","\"\",","\"pos\":","[],","\"rot\":","[]","} ","",""]
[null,null,null,null," ","{","","\"FPS\":","\"\",","\"pos\":","[],","\"rot\":","[]","} ","",""]
[null,null,null,null," ","{","","\"FPS\":","\"\",","\"pos\":","[],","\"rot\":","[]","} ","",""]
[null,null,null,null," ","{","","\"FPS\":","\"\",","\"pos\":","[],","\"rot\":","[]","} ","",""]
[null,null,null,null," ","{","","\"FPS\":","\"\",","\"pos\":","[],","\"rot\":","[]","} ","",""]
[null,null,null,null," ","{","","\"FPS\":","\"\",","\"pos\":","[],","\"rot\":","[]","} ","",""]
[null,null,null,null," ","{","","\"FPS\":","\"\",","\"pos\":","[],","\"rot\":","[]","} ","",""]
[null,null,null,null," ","{","","\"FPS\":","\"\",","\"pos\":","[],","\"rot\":","[]","} ","",""]
[null,null,null,null," ","{","","\"FPS\":","\"\",","\"pos\":","[],","\"rot\":","[]","} ","",""]
[null,null,null,null," ","{","","\"FPS\":","\"\",","\"pos\":","[],","\"rot\":","[]","} ","",""]
[null,null,null,null," ","{","","\"FPS\":","\"\",","\"pos\":","[],","\"rot\":","[]","} ","",""]
[null,null,null,null," ","{","","\"FPS\":","\"\",","\"pos\":","[],","\"rot\":","[]","} ","",""]
[null,null,null,null," ","{","","\"FPS\":","\"\",","\"pos\":","[],","\"rot\":","[]","} ","",""]
[null,null,null,null," ","{","","\"FPS\":","\"\",","\"pos\":","[],","\"rot\":","[]","} ","",""]
[null,null,null,null," ","{","","\"FPS\":","\"\",","\"pos\":","[],","\"rot\":","[]","} ","",""]
[null,null,null,null," ","{","","\"FPS\":","\"\",","\"pos\":","[],","\"rot\":","[]","} ","",""]
[null,null,null,null," ","{","","\"FPS\":","\"\",","\"pos\":","[],","\"rot\":","[]","} ","",""]
[null,null,null,null," ","{","","\"FPS\":","\"\",","\"pos\":","[],","\"rot\":","[]","} ","",""]
[null,null,null,null," ","{","","\"FPS\":","\"\",","\"pos\":","[],","\"rot\":","[]","} ","",""]
[null,null,null,null," ","{","","\"FPS\":","\"\",","\"pos\":","[],","\"rot\":","[]","} ","",""]
[null,null,null,null," ","{","","\"FPS\":","\"\",","\"pos\":","[],","\"rot\":","[]","} ","",""]
[null,null,null,null," ","{","","\"FPS\":","\"\",","\"pos\":","[],","\"rot\":","[]","} ","",""]
[null,null,null,null," ","{","","\"FPS\":","\"\",","\"pos\":","[],","\"rot\":","[]","} ","",""]
[null,null,null,null," ","{","","\"FPS\":","\"\",","\"pos\":","[],","\"rot\":","[]","} ","",""]
[null,null,null,null," ","{","","\"FPS\":","\"\",","\"pos\":","[],","\"rot\":","[]","} ","",""]
[null,null,null,null," ","{","","\"FPS\":","\"\",","\"pos\":","[],","\"rot\":","[]","} ","",""]
[null,null,null,null," ","{","","\"FPS\":","\"\",","\"pos\":","[],","\"rot\":","[]","} ","",""]
[null,null,null,null," ","{","","\"FPS\":","\"\",","\"pos\":","[],","\"rot\":","[]","} ","",""]
[null,null,null,null," ","{","","\"FPS\":","\"\",","\"pos\":","[],","\"rot\":","[]","} ","",""]
[null,null,null,null," ","{","","\"FPS\":","\"\",","\"pos\":","[],","\"rot\":","[]","} ","",""]
[null,null,null,null," ","{","","\"FPS\":","\"\",","\"pos\":","[],","\"rot\":","[]","} ","",""]
[null,null,null,null," ","{","","\"FPS\":","\"\",","\"pos\":","[],","\"rot\":","[]","} ","",""]
[null,null,null,null," ","{","","\"FPS\":","\"\",","\"pos\":","[],","\"rot\":","[]","} ","",""]
[null,null,null,null," ","{",{"$f":"IF(A69<>\"\",CONCATENATE(\"\"\"\",A$3,\"\"\": \"\"\",A69,\"\"\", \"),\"\")","v":""},"\"FPS\":",{"$f":"CONCATENATE(\"\"\"\",B69,\"\"\"\",\",\")","v":"\"\","},"\"pos\":",{"$f":"CONCATENATE(\"[\",C69,\"]\",\",\")","v":"[],"},"\"rot\":",{"$f":"CONCATENATE(\"[\",D69,\"]\")","v":"[]"},"} ",{"$f":"IF(A69<>\"\",CONCATENATE(F69,G69,H69,I69,J69,K69,L69,M69,N69),\"\")","v":""},{"$f":"CONCATENATE(IF(AND(P68<>\"\",Q68=\"\"),CONCATENATE(P68,IF(A69<>\"\",\",\",\"\")),\"\"),O69)","v":""}]
[null,null,null,null," ","{","","\"FPS\":","\"\",","\"pos\":","[],","\"rot\":","[]","} ","",""]
[null,null,null,null," ","{","","\"FPS\":","\"\",","\"pos\":","[],","\"rot\":","[]","} ","",""]
[null,null,null,null," ","{","","\"FPS\":","\"\",","\"pos\":","[],","\"rot\":","[]","} ","",""]
[null,null,null,null," ","{","","\"FPS\":","\"\",","\"pos\":","[],","\"rot\":","[]","} ","",""]
[null,null,null,null," ","{","","\"FPS\":","\"\",","\"pos\":","[],","\"rot\":","[]","} ","",""]
[null,null,null,null," ","{","","\"FPS\":","\"\",","\"pos\":","[],","\"rot\":","[]","} ","",""]
[null,null,null,null," ","{","","\"FPS\":","\"\",","\"pos\":","[],","\"rot\":","[]","} ","",""]
[null,null,null,null," ","{","","\"FPS\":","\"\",","\"pos\":","[],","\"rot\":","[]","} ","",""]
[null,null,null,null," ","{","","\"FPS\":","\"\",","\"pos\":","[],","\"rot\":","[]","} ","",""]
[null,null,null,null," ","{","","\"FPS\":","\"\",","\"pos\":","[],","\"rot\":","[]","} ","",""]
[null,null,null,null," ","{","","\"FPS\":","\"\",","\"pos\":","[],","\"rot\":","[]","} ","",""]
[null,null,null,null," ","{","","\"FPS\":","\"\",","\"pos\":","[],","\"rot\":","[]","} ","",""]
[null,null,null,null," ","{","","\"FPS\":","\"\",","\"pos\":","[],","\"rot\":","[]","} ","",""]
[null,null,null,null," ","{","","\"FPS\":","\"\",","\"pos\":","[],","\"rot\":","[]","} ","",""]
[null,null,null,null," ","{","","\"FPS\":","\"\",","\"pos\":","[],","\"rot\":","[]","} ","",""]
[null,null,null,null," ","{","","\"FPS\":","\"\",","\"pos\":","[],","\"rot\":","[]","} ","",""]
[null,null,null,null," ","{","","\"FPS\":","\"\",","\"pos\":","[],","\"rot\":","[]","} ","",""]
[null,null,null,null," ","{","","\"FPS\":","\"\",","\"pos\":","[],","\"rot\":","[]","} ","",""]
[null,null,null,null," ","{","","\"FPS\":","\"\",","\"pos\":","[],","\"rot\":","[]","} ","",""]
[null,null,null,null," ","{","","\"FPS\":","\"\",","\"pos\":","[],","\"rot\":","[]","} ","",""]
[null,null,null,null," ","{","","\"FPS\":","\"\",","\"pos\":","[],","\"rot\":","[]","} ","",""]
[null,null,null,null," ","{","","\"FPS\":","\"\",","\"pos\":","[],","\"rot\":","[]","} ","",""]
[null,null,null,null," ","{","","\"FPS\":","\"\",","\"pos\":","[],","\"rot\":","[]","} ","",""]
[null,null,null,null," ","{","","\"FPS\":","\"\",","\"pos\":","[],","\"rot\":","[]","} ","",""]
[null,null,null,null," ","{","","\"FPS\":","\"\",","\"pos\":","[],","\"rot\":","[]","} ","",""]
[null,null,null,null," ","{","","\"FPS\":","\"\",","\"pos\":","[],","\"rot\":","[]","} ","",""]
[null,null,null,null," ","{","","\"FPS\":","\"\",","\"pos\":","[],","\"rot\":","[]","} ","",""]
[null,null,null,null," ","{","","\"FPS\":","\"\",","\"pos\":","[],","\"rot\":","[]","} ","",""]
[null,null,null,null," ","{","","\"FPS\":","\"\",","\"pos\":","[],","\"rot\":","[]","} ","",""]
[null,null,null,null," ","{","","\"FPS\":","\"\",","\"pos\":","[],","\"rot\":","[]","} ","",""]
[null,null,null,null," ","{","","\"FPS\":","\"\",","\"pos\":","[],","\"rot\":","[]","} ","",""]
[null,null,null,null," ","{","","\"FPS\":","\"\",","\"pos\":","[],","\"rot\":","[]","} ","",""]
[null,null,null,null," ","{","","\"FPS\":","\"\",","\"pos\":","[],","\"rot\":","[]","} ","",""]
[null,null,null,null," ","{","","\"FPS\":","\"\",","\"pos\":","[],","\"rot\":","[]","} ","",""]
[null,null,null,null," ","{","","\"FPS\":","\"\",","\"pos\":","[],","\"rot\":","[]","} ","",""]
[null,null,null,null," ","{","","\"FPS\":","\"\",","\"pos\":","[],","\"rot\":","[]","} ","",""]
[null,null,null,null," ","{","","\"FPS\":","\"\",","\"pos\":","[],","\"rot\":","[]","} ","",""]
[null,null,null,null," ","{","","\"FPS\":","\"\",","\"pos\":","[],","\"rot\":","[]","} ","",""]
[null,null,null,null," ","{","","\"FPS\":","\"\",","\"pos\":","[],","\"rot\":","[]","} ","",""]
[null,null,null,null," ","{","","\"FPS\":","\"\",","\"pos\":","[],","\"rot\":","[]","} ","",""]
[null,null,null,null," ","{","","\"FPS\":","\"\",","\"pos\":","[],","\"rot\":","[]","} ","",""]
[null,null,null,null," ","{","","\"FPS\":","\"\",","\"pos\":","[],","\"rot\":","[]","} ","",""]
[null,null,null,null," ","{","","\"FPS\":","\"\",","\"pos\":","[],","\"rot\":","[]","} ","",""]
[null,null,null,null," ","{","","\"FPS\":","\"\",","\"pos\":","[],","\"rot\":","[]","} ","",""]
[null,null,null,null," ","{","","\"FPS\":","\"\",","\"pos\":","[],","\"rot\":","[]","} ","",""]
[null,null,null,null," ","{","","\"FPS\":","\"\",","\"pos\":","[],","\"rot\":","[]","} ","",""]
[null,null,null,null," ","{","","\"FPS\":","\"\",","\"pos\":","[],","\"rot\":","[]","} ","",""]
[null,null,null,null," ","{","","\"FPS\":","\"\",","\"pos\":","[],","\"rot\":","[]","} ","",""]
[null,null,null,null," ","{","","\"FPS\":","\"\",","\"pos\":","[],","\"rot\":","[]","} ","",""]
[null,null,null,null," ","{","","\"FPS\":","\"\",","\"pos\":","[],","\"rot\":","[]","} ","",""]
[null,null,null,null," ","{","","\"FPS\":","\"\",","\"pos\":","[],","\"rot\":","[]","} ","",""]
[null,null,null,null," ","{","","\"FPS\":","\"\",","\"pos\":","[],","\"rot\":","[]","} ","",""]
[null,null,null,null," ","{","","\"FPS\":","\"\",","\"pos\":","[],","\"rot\":","[]","} ","",""]
[null,null,null,null," ","{","","\"FPS\":","\"\",","\"pos\":","[],","\"rot\":","[]","} ","",""]
[null,null,null,null," ","{","","\"FPS\":","\"\",","\"pos\":","[],","\"rot\":","[]","} ","",""]
[null,null,null,null," ","{","","\"FPS\":","\"\",","\"pos\":","[],","\"rot\":","[]","} ","",""]
[null,null,null,null," ","{","","\"FPS\":","\"\",","\"pos\":","[],","\"rot\":","[]","} ","",""]
[null,null,null,null," ","{","","\"FPS\":","\"\",","\"pos\":","[],","\"rot\":","[]","} ","",""]
[null,null,null,null," ","{","","\"FPS\":","\"\",","\"pos\":","[],","\"rot\":","[]","} ","",""]
[null,null,null,null," ","{","","\"FPS\":","\"\",","\"pos\":","[],","\"rot\":","[]","} ","",""]
[null,null,null,null," ","{","","\"FPS\":","\"\",","\"pos\":","[],","\"rot\":","[]","} ","",""]
[null,null,null,null," ","{","","\"FPS\":","\"\",","\"pos\":","[],","\"rot\":","[]","} ","",""]
[null,null,null,null," ","{","","\"FPS\":","\"\",","\"pos\":","[],","\"rot\":","[]","} ","",""]
[null,null,null,null," ","{",{"$f":"IF(A133<>\"\",CONCATENATE(\"\"\"\",A$3,\"\"\": \"\"\",A133,\"\"\", \"),\"\")","v":""},"\"FPS\":",{"$f":"CONCATENATE(\"\"\"\",B133,\"\"\"\",\",\")","v":"\"\","},"\"pos\":",{"$f":"CONCATENATE(\"[\",C133,\"]\",\",\")","v":"[],"},"\"rot\":",{"$f":"CONCATENATE(\"[\",D133,\"]\")","v":"[]"},"} ",{"$f":"IF(A133<>\"\",CONCATENATE(F133,G133,H133,I133,J133,K133,L133,M133,N133),\"\")","v":""},{"$f":"CONCATENATE(IF(AND(P132<>\"\",Q132=\"\"),CONCATENATE(P132,IF(A133<>\"\",\",\",\"\")),\"\"),O133)","v":""}]
[null,null,null,null," ","{","","\"FPS\":","\"\",","\"pos\":","[],","\"rot\":","[]","} ","",""]
[null,null,null,null," ","{","","\"FPS\":","\"\",","\"pos\":","[],","\"rot\":","[]","} ","",""]
[null,null,null,null," ","{","","\"FPS\":","\"\",","\"pos\":","[],","\"rot\":","[]","} ","",""]
[null,null,null,null," ","{","","\"FPS\":","\"\",","\"pos\":","[],","\"rot\":","[]","} ","",""]
[null,null,null,null," ","{","","\"FPS\":","\"\",","\"pos\":","[],","\"rot\":","[]","} ","",""]
[null,null,null,null," ","{","","\"FPS\":","\"\",","\"pos\":","[],","\"rot\":","[]","} ","",""]
[null,null,null,null," ","{","","\"FPS\":","\"\",","\"pos\":","[],","\"rot\":","[]","} ","",""]
[null,null,null,null," ","{","","\"FPS\":","\"\",","\"pos\":","[],","\"rot\":","[]","} ","",""]
[null,null,null,null," ","{","","\"FPS\":","\"\",","\"pos\":","[],","\"rot\":","[]","} ","",""]
[null,null,null,null," ","{","","\"FPS\":","\"\",","\"pos\":","[],","\"rot\":","[]","} ","",""]
[null,null,null,null," ","{","","\"FPS\":","\"\",","\"pos\":","[],","\"rot\":","[]","} ","",""]
[null,null,null,null," ","{","","\"FPS\":","\"\",","\"pos\":","[],","\"rot\":","[]","} ","",""]
[null,null,null,null," ","{","","\"FPS\":","\"\",","\"pos\":","[],","\"rot\":","[]","} ","",""]
[null,null,null,null," ","{","","\"FPS\":","\"\",","\"pos\":","[],","\"rot\":","[]","} ","",""]
[null,null,null,null," ","{","","\"FPS\":","\"\",","\"pos\":","[],","\"rot\":","[]","} ","","",1]
[null,null,null,null," ","{","","\"FPS\":","\"\",","\"pos\":","[],","\"rot\":","[]","} ","",""]
[null,null,null,null," ","{","","\"FPS\":","\"\",","\"pos\":","[],","\"rot\":","[]","} ","",""]
[null,null,null,null," ","{","","\"FPS\":","\"\",","\"pos\":","[],","\"rot\":","[]","} ","",""]
[null,null,null,null," ","{","","\"FPS\":","\"\",","\"pos\":","[],","\"rot\":","[]","} ","",""]
[null,null,null,null," ","{","","\"FPS\":","\"\",","\"pos\":","[],","\"rot\":","[]","} ","",""]
[null,null,null,null," ","{","","\"FPS\":","\"\",","\"pos\":","[],","\"rot\":","[]","} ","",""]
[null,null,null,null," ","{","","\"FPS\":","\"\",","\"pos\":","[],","\"rot\":","[]","} ","",""]
[null,null,null,null," ","{","","\"FPS\":","\"\",","\"pos\":","[],","\"rot\":","[]","} ","",""]
[null,null,null,null," ","{","","\"FPS\":","\"\",","\"pos\":","[],","\"rot\":","[]","} ","",""]
[null,null,null,null," ","{","","\"FPS\":","\"\",","\"pos\":","[],","\"rot\":","[]","} ","",""]
[null,null,null,null," ","{","","\"FPS\":","\"\",","\"pos\":","[],","\"rot\":","[]","} ","",""]
[null,null,null,null," ","{","","\"FPS\":","\"\",","\"pos\":","[],","\"rot\":","[]","} ","",""]
[null,null,null,null," ","{","","\"FPS\":","\"\",","\"pos\":","[],","\"rot\":","[]","} ","",""]
[null,null,null,null," ","{","","\"FPS\":","\"\",","\"pos\":","[],","\"rot\":","[]","} ","",""]
[null,null,null,null," ","{","","\"FPS\":","\"\",","\"pos\":","[],","\"rot\":","[]","} ","",""]
[null,null,null,null," ","{","","\"FPS\":","\"\",","\"pos\":","[],","\"rot\":","[]","} ","",""]
[null,null,null,null," ","{","","\"FPS\":","\"\",","\"pos\":","[],","\"rot\":","[]","} ","",""]
[null,null,null,null," ","{","","\"FPS\":","\"\",","\"pos\":","[],","\"rot\":","[]","} ","",""]
[null,null,null,null," ","{","","\"FPS\":","\"\",","\"pos\":","[],","\"rot\":","[]","} ","",""]
[null,null,null,null," ","{","","\"FPS\":","\"\",","\"pos\":","[],","\"rot\":","[]","} ","",""]
[null,null,null,null," ","{","","\"FPS\":","\"\",","\"pos\":","[],","\"rot\":","[]","} ","",""]
[null,null,null,null," ","{","","\"FPS\":","\"\",","\"pos\":","[],","\"rot\":","[]","} ","",""]
[null,null,null,null," ","{","","\"FPS\":","\"\",","\"pos\":","[],","\"rot\":","[]","} ","",""]
[null,null,null,null," ","{","","\"FPS\":","\"\",","\"pos\":","[],","\"rot\":","[]","} ","",""]
[null,null,null,null," ","{","","\"FPS\":","\"\",","\"pos\":","[],","\"rot\":","[]","} ","",""]
[null,null,null,null," ","{","","\"FPS\":","\"\",","\"pos\":","[],","\"rot\":","[]","} ","",""]
[null,null,null,null," ","{","","\"FPS\":","\"\",","\"pos\":","[],","\"rot\":","[]","} ","",""]
[null,null,null,null," ","{","","\"FPS\":","\"\",","\"pos\":","[],","\"rot\":","[]","} ","",""]
[null,null,null,null," ","{","","\"FPS\":","\"\",","\"pos\":","[],","\"rot\":","[]","} ","",""]
[null,null,null,null," ","{","","\"FPS\":","\"\",","\"pos\":","[],","\"rot\":","[]","} ","",""]
[null,null,null,null," ","{","","\"FPS\":","\"\",","\"pos\":","[],","\"rot\":","[]","} ","",""]
[null,null,null,null," ","{","","\"FPS\":","\"\",","\"pos\":","[],","\"rot\":","[]","} ","",""]
[null,null,null,null," ","{","","\"FPS\":","\"\",","\"pos\":","[],","\"rot\":","[]","} ","",""]
[null,null,null,null," ","{","","\"FPS\":","\"\",","\"pos\":","[],","\"rot\":","[]","} ","",""]
[null,null,null,null," ","{","","\"FPS\":","\"\",","\"pos\":","[],","\"rot\":","[]","} ","",""]
[null,null,null,null," ","{","","\"FPS\":","\"\",","\"pos\":","[],","\"rot\":","[]","} ","",""]
[null,null,null,null," ","{","","\"FPS\":","\"\",","\"pos\":","[],","\"rot\":","[]","} ","",""]
[null,null,null,null," ","{","","\"FPS\":","\"\",","\"pos\":","[],","\"rot\":","[]","} ","",""]
[null,null,null,null," ","{","","\"FPS\":","\"\",","\"pos\":","[],","\"rot\":","[]","} ","",""]
[null,null,null,null," ","{","","\"FPS\":","\"\",","\"pos\":","[],","\"rot\":","[]","} ","",""]
[null,null,null,null," ","{","","\"FPS\":","\"\",","\"pos\":","[],","\"rot\":","[]","} ","",""]
[null,null,null,null," ","{","","\"FPS\":","\"\",","\"pos\":","[],","\"rot\":","[]","} ","",""]
[null,null,null,null," ","{","","\"FPS\":","\"\",","\"pos\":","[],","\"rot\":","[]","} ","",""]
[null,null,null,null," ","{","","\"FPS\":","\"\",","\"pos\":","[],","\"rot\":","[]","} ","",""]
[null,null,null,null," ","{","","\"FPS\":","\"\",","\"pos\":","[],","\"rot\":","[]","} ","",""]
[null,null,null,null," ","{","","\"FPS\":","\"\",","\"pos\":","[],","\"rot\":","[]","} ","",""]
[null,null,null,null," ","{","","\"FPS\":","\"\",","\"pos\":","[],","\"rot\":","[]","} ","",""]
[null,null,null,null," ","{","","\"FPS\":","\"\",","\"pos\":","[],","\"rot\":","[]","} ","",""]
[null,null,null,null," ","{",{"$f":"IF(A197<>\"\",CONCATENATE(\"\"\"\",A$3,\"\"\": \"\"\",A197,\"\"\", \"),\"\")","v":""},"\"FPS\":",{"$f":"CONCATENATE(\"\"\"\",B197,\"\"\"\",\",\")","v":"\"\","},"\"pos\":",{"$f":"CONCATENATE(\"[\",C197,\"]\",\",\")","v":"[],"},"\"rot\":",{"$f":"CONCATENATE(\"[\",D197,\"]\")","v":"[]"},"} ",{"$f":"IF(A197<>\"\",CONCATENATE(F197,G197,H197,I197,J197,K197,L197,M197,N197),\"\")","v":""},{"$f":"CONCATENATE(IF(AND(P196<>\"\",Q196=\"\"),CONCATENATE(P196,IF(A197<>\"\",\",\",\"\")),\"\"),O197)","v":""}]
[null,null,null,null," ","{","","\"FPS\":","\"\",","\"pos\":","[],","\"rot\":","[]","} ","",""]
[null,null,null,null," ","{","","\"FPS\":","\"\",","\"pos\":","[],","\"rot\":","[]","} ","",""]
[null,null,null,null," ","{","","\"FPS\":","\"\",","\"pos\":","[],","\"rot\":","[]","} ","",""]
[null,null,null,null," ","{","","\"FPS\":","\"\",","\"pos\":","[],","\"rot\":","[]","} ","",""]
[null,null,null,null," ","{","","\"FPS\":","\"\",","\"pos\":","[],","\"rot\":","[]","} ","",""]
[null,null,null,null," ","{","","\"FPS\":","\"\",","\"pos\":","[],","\"rot\":","[]","} ","",""]
[null,null,null,null," ","{","","\"FPS\":","\"\",","\"pos\":","[],","\"rot\":","[]","} ","",""]
[null,null,null,null," ","{","","\"FPS\":","\"\",","\"pos\":","[],","\"rot\":","[]","} ","",""]
[null,null,null,null," ","{","","\"FPS\":","\"\",","\"pos\":","[],","\"rot\":","[]","} ","",""]
[null,null,null,null," ","{","","\"FPS\":","\"\",","\"pos\":","[],","\"rot\":","[]","} ","",""]
[null,null,null,null," ","{","","\"FPS\":","\"\",","\"pos\":","[],","\"rot\":","[]","} ","",""]
[null,null,null,null," ","{","","\"FPS\":","\"\",","\"pos\":","[],","\"rot\":","[]","} ","",""]
[null,null,null,null," ","{","","\"FPS\":","\"\",","\"pos\":","[],","\"rot\":","[]","} ","",""]
[null,null,null,null," ","{","","\"FPS\":","\"\",","\"pos\":","[],","\"rot\":","[]","} ","",""]
[null,null,null,null," ","{","","\"FPS\":","\"\",","\"pos\":","[],","\"rot\":","[]","} ","",""]
[null,null,null,null," ","{","","\"FPS\":","\"\",","\"pos\":","[],","\"rot\":","[]","} ","",""]
[null,null,null,null," ","{","","\"FPS\":","\"\",","\"pos\":","[],","\"rot\":","[]","} ","",""]
[null,null,null,null," ","{","","\"FPS\":","\"\",","\"pos\":","[],","\"rot\":","[]","} ","",""]
[null,null,null,null," ","{","","\"FPS\":","\"\",","\"pos\":","[],","\"rot\":","[]","} ","",""]
[null,null,null,null," ","{","","\"FPS\":","\"\",","\"pos\":","[],","\"rot\":","[]","} ","",""]
[null,null,null,null," ","{","","\"FPS\":","\"\",","\"pos\":","[],","\"rot\":","[]","} ","",""]
[null,null,null,null," ","{","","\"FPS\":","\"\",","\"pos\":","[],","\"rot\":","[]","} ","",""]
[null,null,null,null," ","{","","\"FPS\":","\"\",","\"pos\":","[],","\"rot\":","[]","} ","",""]
[null,null,null,null," ","{","","\"FPS\":","\"\",","\"pos\":","[],","\"rot\":","[]","} ","",""]
[null,null,null,null," ","{","","\"FPS\":","\"\",","\"pos\":","[],","\"rot\":","[]","} ","",""]
[null,null,null,null," ","{","","\"FPS\":","\"\",","\"pos\":","[],","\"rot\":","[]","} ","",""]
[null,null,null,null," ","{","","\"FPS\":","\"\",","\"pos\":","[],","\"rot\":","[]","} ","",""]
[null,null,null,null," ","{","","\"FPS\":","\"\",","\"pos\":","[],","\"rot\":","[]","} ","",""]
[null,null,null,null," ","{","","\"FPS\":","\"\",","\"pos\":","[],","\"rot\":","[]","} ","",""]
[null,null,null,null," ","{","","\"FPS\":","\"\",","\"pos\":","[],","\"rot\":","[]","} ","",""]
[null,null,null,null," ","{","","\"FPS\":","\"\",","\"pos\":","[],","\"rot\":","[]","} ","",""]
[null,null,null,null," ","{","","\"FPS\":","\"\",","\"pos\":","[],","\"rot\":","[]","} ","",""]
[null,null,null,null," ","{","","\"FPS\":","\"\",","\"pos\":","[],","\"rot\":","[]","} ","",""]
[null,null,null,null," ","{","","\"FPS\":","\"\",","\"pos\":","[],","\"rot\":","[]","} ","",""]
[null,null,null,null," ","{","","\"FPS\":","\"\",","\"pos\":","[],","\"rot\":","[]","} ","",""]
[null,null,null,null," ","{","","\"FPS\":","\"\",","\"pos\":","[],","\"rot\":","[]","} ","",""]
[null,null,null,null," ","{","","\"FPS\":","\"\",","\"pos\":","[],","\"rot\":","[]","} ","",""]
[null,null,null,null," ","{","","\"FPS\":","\"\",","\"pos\":","[],","\"rot\":","[]","} ","",""]
[null,null,null,null," ","{","","\"FPS\":","\"\",","\"pos\":","[],","\"rot\":","[]","} ","",""]
[null,null,null,null," ","{","","\"FPS\":","\"\",","\"pos\":","[],","\"rot\":","[]","} ","",""]
[null,null,null,null," ","{","","\"FPS\":","\"\",","\"pos\":","[],","\"rot\":","[]","} ","",""]
[null,null,null,null," ","{","","\"FPS\":","\"\",","\"pos\":","[],","\"rot\":","[]","} ","",""]
[null,null,null,null," ","{","","\"FPS\":","\"\",","\"pos\":","[],","\"rot\":","[]","} ","",""]
[null,null,null,null," ","{","","\"FPS\":","\"\",","\"pos\":","[],","\"rot\":","[]","} ","",""]
[null,null,null,null," ","{","","\"FPS\":","\"\",","\"pos\":","[],","\"rot\":","[]","} ","",""]
[null,null,null,null," ","{","","\"FPS\":","\"\",","\"pos\":","[],","\"rot\":","[]","} ","",""]
[null,null,null,null," ","{","","\"FPS\":","\"\",","\"pos\":","[],","\"rot\":","[]","} ","",""]
[null,null,null,null," ","{","","\"FPS\":","\"\",","\"pos\":","[],","\"rot\":","[]","} ","",""]
[null,null,null,null," ","{","","\"FPS\":","\"\",","\"pos\":","[],","\"rot\":","[]","} ","",""]
[null,null,null,null," ","{","","\"FPS\":","\"\",","\"pos\":","[],","\"rot\":","[]","} ","",""]
[null,null,null,null," ","{","","\"FPS\":","\"\",","\"pos\":","[],","\"rot\":","[]","} ","",""]
[null,null,null,null," ","{","","\"FPS\":","\"\",","\"pos\":","[],","\"rot\":","[]","} ","",""]
[null,null,null,null," ","{","","\"FPS\":","\"\",","\"pos\":","[],","\"rot\":","[]","} ","",""]
[null,null,null,null," ","{","","\"FPS\":","\"\",","\"pos\":","[],","\"rot\":","[]","} ","",""]
[null,null,null,null," ","{","","\"FPS\":","\"\",","\"pos\":","[],","\"rot\":","[]","} ","",""]
[null,null,null,null," ","{","","\"FPS\":","\"\",","\"pos\":","[],","\"rot\":","[]","} ","",""]
[null,null,null,null," ","{","","\"FPS\":","\"\",","\"pos\":","[],","\"rot\":","[]","} ","",""]
[null,null,null,null," ","{","","\"FPS\":","\"\",","\"pos\":","[],","\"rot\":","[]","} ","",""]
[null,null,null,null," ","{","","\"FPS\":","\"\",","\"pos\":","[],","\"rot\":","[]","} ","",""]
[null,null,null,null," ","{","","\"FPS\":","\"\",","\"pos\":","[],","\"rot\":","[]","} ","",""]
[null,null,null,null," ","{","","\"FPS\":","\"\",","\"pos\":","[],","\"rot\":","[]","} ","",""]
[null,null,null,null," ","{","","\"FPS\":","\"\",","\"pos\":","[],","\"rot\":","[]","} ","",""]
[null,null,null,null," ","{","","\"FPS\":","\"\",","\"pos\":","[],","\"rot\":","[]","} ","",""]
[null,null,null,null," ","{",{"$f":"IF(A261<>\"\",CONCATENATE(\"\"\"\",A$3,\"\"\": \"\"\",A261,\"\"\", \"),\"\")","v":""},"\"FPS\":",{"$f":"CONCATENATE(\"\"\"\",B261,\"\"\"\",\",\")","v":"\"\","},"\"pos\":",{"$f":"CONCATENATE(\"[\",C261,\"]\",\",\")","v":"[],"},"\"rot\":",{"$f":"CONCATENATE(\"[\",D261,\"]\")","v":"[]"},"} ",{"$f":"IF(A261<>\"\",CONCATENATE(F261,G261,H261,I261,J261,K261,L261,M261,N261),\"\")","v":""},{"$f":"CONCATENATE(IF(AND(P260<>\"\",Q260=\"\"),CONCATENATE(P260,IF(A261<>\"\",\",\",\"\")),\"\"),O261)","v":""}]
[null,null,null,null," ","{","","\"FPS\":","\"\",","\"pos\":","[],","\"rot\":","[]","} ","",""]
[null,null,null,null," ","{","","\"FPS\":","\"\",","\"pos\":","[],","\"rot\":","[]","} ","",""]
[null,null,null,null," ","{","","\"FPS\":","\"\",","\"pos\":","[],","\"rot\":","[]","} ","",""]
[null,null,null,null," ","{","","\"FPS\":","\"\",","\"pos\":","[],","\"rot\":","[]","} ","",""]
[null,null,null,null," ","{","","\"FPS\":","\"\",","\"pos\":","[],","\"rot\":","[]","} ","",""]
[null,null,null,null," ","{","","\"FPS\":","\"\",","\"pos\":","[],","\"rot\":","[]","} ","",""]
[null,null,null,null," ","{","","\"FPS\":","\"\",","\"pos\":","[],","\"rot\":","[]","} ","",""]
[null,null,null,null," ","{","","\"FPS\":","\"\",","\"pos\":","[],","\"rot\":","[]","} ","",""]
[null,null,null,null," ","{","","\"FPS\":","\"\",","\"pos\":","[],","\"rot\":","[]","} ","",""]
[null,null,null,null," ","{","","\"FPS\":","\"\",","\"pos\":","[],","\"rot\":","[]","} ","",""]
[null,null,null,null," ","{","","\"FPS\":","\"\",","\"pos\":","[],","\"rot\":","[]","} ","",""]
[null,null,null,null," ","{","","\"FPS\":","\"\",","\"pos\":","[],","\"rot\":","[]","} ","",""]
[null,null,null,null," ","{","","\"FPS\":","\"\",","\"pos\":","[],","\"rot\":","[]","} ","",""]
[null,null,null,null," ","{","","\"FPS\":","\"\",","\"pos\":","[],","\"rot\":","[]","} ","",""]
[null,null,null,null," ","{","","\"FPS\":","\"\",","\"pos\":","[],","\"rot\":","[]","} ","",""]
[null,null,null,null," ","{","","\"FPS\":","\"\",","\"pos\":","[],","\"rot\":","[]","} ","",""]
[null,null,null,null," ","{","","\"FPS\":","\"\",","\"pos\":","[],","\"rot\":","[]","} ","",""]
[null,null,null,null," ","{","","\"FPS\":","\"\",","\"pos\":","[],","\"rot\":","[]","} ","",""]
[null,null,null,null," ","{","","\"FPS\":","\"\",","\"pos\":","[],","\"rot\":","[]","} ","",""]
[null,null,null,null," ","{","","\"FPS\":","\"\",","\"pos\":","[],","\"rot\":","[]","} ","",""]
[null,null,null,null," ","{","","\"FPS\":","\"\",","\"pos\":","[],","\"rot\":","[]","} ","",""]
[null,null,null,null," ","{","","\"FPS\":","\"\",","\"pos\":","[],","\"rot\":","[]","} ","",""]
[null,null,null,null," ","{","","\"FPS\":","\"\",","\"pos\":","[],","\"rot\":","[]","} ","",""]
[null,null,null,null," ","{","","\"FPS\":","\"\",","\"pos\":","[],","\"rot\":","[]","} ","",""]
[null,null,null,null," ","{","","\"FPS\":","\"\",","\"pos\":","[],","\"rot\":","[]","} ","",""]
[null,null,null,null," ","{","","\"FPS\":","\"\",","\"pos\":","[],","\"rot\":","[]","} ","",""]
[null,null,null,null," ","{","","\"FPS\":","\"\",","\"pos\":","[],","\"rot\":","[]","} ","",""]
[null,null,null,null," ","{","","\"FPS\":","\"\",","\"pos\":","[],","\"rot\":","[]","} ","",""]
[null,null,null,null," ","{","","\"FPS\":","\"\",","\"pos\":","[],","\"rot\":","[]","} ","",""]
[null,null,null,null," ","{","","\"FPS\":","\"\",","\"pos\":","[],","\"rot\":","[]","} ","",""]
[null,null,null,null," ","{","","\"FPS\":","\"\",","\"pos\":","[],","\"rot\":","[]","} ","",""]
[null,null,null,null," ","{","","\"FPS\":","\"\",","\"pos\":","[],","\"rot\":","[]","} ","",""]
[null,null,null,null," ","{","","\"FPS\":","\"\",","\"pos\":","[],","\"rot\":","[]","} ","",""]
[null,null,null,null," ","{","","\"FPS\":","\"\",","\"pos\":","[],","\"rot\":","[]","} ","",""]
[null,null,null,null," ","{","","\"FPS\":","\"\",","\"pos\":","[],","\"rot\":","[]","} ","",""]
[null,null,null,null," ","{","","\"FPS\":","\"\",","\"pos\":","[],","\"rot\":","[]","} ","",""]
[null,null,null,null," ","{","","\"FPS\":","\"\",","\"pos\":","[],","\"rot\":","[]","} ","",""]
[null,null,null,null," ","{","","\"FPS\":","\"\",","\"pos\":","[],","\"rot\":","[]","} ","",""]
[null,null,null,null," ","{","","\"FPS\":","\"\",","\"pos\":","[],","\"rot\":","[]","} ","",""]
[null,null,null,null," ","{","","\"FPS\":","\"\",","\"pos\":","[],","\"rot\":","[]","} ","",""]
[null,null,null,null," ","{","","\"FPS\":","\"\",","\"pos\":","[],","\"rot\":","[]","} ","",""]
[null,null,null,null," ","{","","\"FPS\":","\"\",","\"pos\":","[],","\"rot\":","[]","} ","",""]
[null,null,null,null," ","{","","\"FPS\":","\"\",","\"pos\":","[],","\"rot\":","[]","} ","",""]
[null,null,null,null," ","{","","\"FPS\":","\"\",","\"pos\":","[],","\"rot\":","[]","} ","",""]
[null,null,null,null," ","{","","\"FPS\":","\"\",","\"pos\":","[],","\"rot\":","[]","} ","",""]
[null,null,null,null," ","{","","\"FPS\":","\"\",","\"pos\":","[],","\"rot\":","[]","} ","",""]
[null,null,null,null," ","{","","\"FPS\":","\"\",","\"pos\":","[],","\"rot\":","[]","} ","",""]
[null,null,null,null," ","{","","\"FPS\":","\"\",","\"pos\":","[],","\"rot\":","[]","} ","",""]
[null,null,null,null," ","{","","\"FPS\":","\"\",","\"pos\":","[],","\"rot\":","[]","} ","",""]
[null,null,null,null," ","{","","\"FPS\":","\"\",","\"pos\":","[],","\"rot\":","[]","} ","",""]
[null,null,null,null," ","{","","\"FPS\":","\"\",","\"pos\":","[],","\"rot\":","[]","} ","",""]
[null,null,null,null," ","{","","\"FPS\":","\"\",","\"pos\":","[],","\"rot\":","[]","} ","",""]
[null,null,null,null," ","{","","\"FPS\":","\"\",","\"pos\":","[],","\"rot\":","[]","} ","",""]
[null,null,null,null," ","{","","\"FPS\":","\"\",","\"pos\":","[],","\"rot\":","[]","} ","",""]
[null,null,null,null," ","{","","\"FPS\":","\"\",","\"pos\":","[],","\"rot\":","[]","} ","",""]
[null,null,null,null," ","{","","\"FPS\":","\"\",","\"pos\":","[],","\"rot\":","[]","} ","",""]
[null,null,null,null," ","{","","\"FPS\":","\"\",","\"pos\":","[],","\"rot\":","[]","} ","",""]
[null,null,null,null," ","{","","\"FPS\":","\"\",","\"pos\":","[],","\"rot\":","[]","} ","",""]
[null,null,null,null," ","{","","\"FPS\":","\"\",","\"pos\":","[],","\"rot\":","[]","} ","",""]
[null,null,null,null," ","{","","\"FPS\":","\"\",","\"pos\":","[],","\"rot\":","[]","} ","",""]
[null,null,null,null," ","{","","\"FPS\":","\"\",","\"pos\":","[],","\"rot\":","[]","} ","",""]
[null,null,null,null," ","{","","\"FPS\":","\"\",","\"pos\":","[],","\"rot\":","[]","} ","",""]
[null,null,null,null," ","{","","\"FPS\":","\"\",","\"pos\":","[],","\"rot\":","[]","} ","",""]
[null,null,null,null," ","{",{"$f":"IF(A325<>\"\",CONCATENATE(\"\"\"\",A$3,\"\"\": \"\"\",A325,\"\"\", \"),\"\")","v":""},"\"FPS\":",{"$f":"CONCATENATE(\"\"\"\",B325,\"\"\"\",\",\")","v":"\"\","},"\"pos\":",{"$f":"CONCATENATE(\"[\",C325,\"]\",\",\")","v":"[],"},"\"rot\":",{"$f":"CONCATENATE(\"[\",D325,\"]\")","v":"[]"},"} ",{"$f":"IF(A325<>\"\",CONCATENATE(F325,G325,H325,I325,J325,K325,L325,M325,N325),\"\")","v":""},{"$f":"CONCATENATE(IF(AND(P324<>\"\",Q324=\"\"),CONCATENATE(P324,IF(A325<>\"\",\",\",\"\")),\"\"),O325)","v":""}]
[null,null,null,null," ","{","","\"FPS\":","\"\",","\"pos\":","[],","\"rot\":","[]","} ","",""]
[null,null,null,null," ","{","","\"FPS\":","\"\",","\"pos\":","[],","\"rot\":","[]","} ","",""]
[null,null,null,null," ","{","","\"FPS\":","\"\",","\"pos\":","[],","\"rot\":","[]","} ","",""]
[null,null,null,null," ","{","","\"FPS\":","\"\",","\"pos\":","[],","\"rot\":","[]","} ","",""]
[null,null,null,null," ","{","","\"FPS\":","\"\",","\"pos\":","[],","\"rot\":","[]","} ","",""]
[null,null,null,null," ","{","","\"FPS\":","\"\",","\"pos\":","[],","\"rot\":","[]","} ","",""]
[null,null,null,null," ","{","","\"FPS\":","\"\",","\"pos\":","[],","\"rot\":","[]","} ","",""]
[null,null,null,null," ","{","","\"FPS\":","\"\",","\"pos\":","[],","\"rot\":","[]","} ","",""]
[null,null,null,null," ","{","","\"FPS\":","\"\",","\"pos\":","[],","\"rot\":","[]","} ","",""]
[null,null,null,null," ","{","","\"FPS\":","\"\",","\"pos\":","[],","\"rot\":","[]","} ","",""]
[null,null,null,null," ","{","","\"FPS\":","\"\",","\"pos\":","[],","\"rot\":","[]","} ","",""]
[null,null,null,null," ","{","","\"FPS\":","\"\",","\"pos\":","[],","\"rot\":","[]","} ","",""]
[null,null,null,null," ","{","","\"FPS\":","\"\",","\"pos\":","[],","\"rot\":","[]","} ","",""]
[null,null,null,null," ","{","","\"FPS\":","\"\",","\"pos\":","[],","\"rot\":","[]","} ","",""]
[null,null,null,null," ","{","","\"FPS\":","\"\",","\"pos\":","[],","\"rot\":","[]","} ","",""]
[null,null,null,null," ","{","","\"FPS\":","\"\",","\"pos\":","[],","\"rot\":","[]","} ","",""]
[null,null,null,null," ","{","","\"FPS\":","\"\",","\"pos\":","[],","\"rot\":","[]","} ","",""]
[null,null,null,null," ","{","","\"FPS\":","\"\",","\"pos\":","[],","\"rot\":","[]","} ","",""]
[null,null,null,null," ","{","","\"FPS\":","\"\",","\"pos\":","[],","\"rot\":","[]","} ","",""]
[null,null,null,null," ","{","","\"FPS\":","\"\",","\"pos\":","[],","\"rot\":","[]","} ","",""]
[null,null,null,null," ","{","","\"FPS\":","\"\",","\"pos\":","[],","\"rot\":","[]","} ","",""]
[null,null,null,null," ","{","","\"FPS\":","\"\",","\"pos\":","[],","\"rot\":","[]","} ","",""]
[null,null,null,null," ","{","","\"FPS\":","\"\",","\"pos\":","[],","\"rot\":","[]","} ","",""]
[null,null,null,null," ","{","","\"FPS\":","\"\",","\"pos\":","[],","\"rot\":","[]","} ","",""]
[null,null,null,null," ","{","","\"FPS\":","\"\",","\"pos\":","[],","\"rot\":","[]","} ","",""]
[null,null,null,null," ","{","","\"FPS\":","\"\",","\"pos\":","[],","\"rot\":","[]","} ","",""]
[null,null,null,null," ","{","","\"FPS\":","\"\",","\"pos\":","[],","\"rot\":","[]","} ","",""]
[null,null,null,null," ","{","","\"FPS\":","\"\",","\"pos\":","[],","\"rot\":","[]","} ","",""]
[null,null,null,null," ","{","","\"FPS\":","\"\",","\"pos\":","[],","\"rot\":","[]","} ","",""]
[null,null,null,null," ","{","","\"FPS\":","\"\",","\"pos\":","[],","\"rot\":","[]","} ","",""]
[null,null,null,null," ","{","","\"FPS\":","\"\",","\"pos\":","[],","\"rot\":","[]","} ","",""]
[null,null,null,null," ","{","","\"FPS\":","\"\",","\"pos\":","[],","\"rot\":","[]","} ","",""]
[null,null,null,null," ","{","","\"FPS\":","\"\",","\"pos\":","[],","\"rot\":","[]","} ","",""]
[null,null,null,null," ","{","","\"FPS\":","\"\",","\"pos\":","[],","\"rot\":","[]","} ","",""]
[null,null,null,null," ","{","","\"FPS\":","\"\",","\"pos\":","[],","\"rot\":","[]","} ","",""]
[null,null,null,null," ","{","","\"FPS\":","\"\",","\"pos\":","[],","\"rot\":","[]","} ","",""]
[null,null,null,null," ","{","","\"FPS\":","\"\",","\"pos\":","[],","\"rot\":","[]","} ","",""]
[null,null,null,null," ","{","","\"FPS\":","\"\",","\"pos\":","[],","\"rot\":","[]","} ","",""]
[null,null,null,null," ","{","","\"FPS\":","\"\",","\"pos\":","[],","\"rot\":","[]","} ","",""]
[null,null,null,null," ","{","","\"FPS\":","\"\",","\"pos\":","[],","\"rot\":","[]","} ","",""]
[null,null,null,null," ","{","","\"FPS\":","\"\",","\"pos\":","[],","\"rot\":","[]","} ","",""]
[null,null,null,null," ","{","","\"FPS\":","\"\",","\"pos\":","[],","\"rot\":","[]","} ","",""]
[null,null,null,null," ","{","","\"FPS\":","\"\",","\"pos\":","[],","\"rot\":","[]","} ","","",2]
[null,null,null,null," ","{","","\"FPS\":","\"\",","\"pos\":","[],","\"rot\":","[]","} ","",""]
[null,null,null,null," ","{","","\"FPS\":","\"\",","\"pos\":","[],","\"rot\":","[]","} ","",""]
[null,null,null,null," ","{","","\"FPS\":","\"\",","\"pos\":","[],","\"rot\":","[]","} ","",""]
[null,null,null,null," ","{","","\"FPS\":","\"\",","\"pos\":","[],","\"rot\":","[]","} ","",""]
[null,null,null,null," ","{","","\"FPS\":","\"\",","\"pos\":","[],","\"rot\":","[]","} ","",""]
[null,null,null,null," ","{","","\"FPS\":","\"\",","\"pos\":","[],","\"rot\":","[]","} ","",""]
[null,null,null,null," ","{","","\"FPS\":","\"\",","\"pos\":","[],","\"rot\":","[]","} ","",""]
[null,null,null,null," ","{","","\"FPS\":","\"\",","\"pos\":","[],","\"rot\":","[]","} ","",""]
[null,null,null,null," ","{","","\"FPS\":","\"\",","\"pos\":","[],","\"rot\":","[]","} ","",""]
[null,null,null,null," ","{","","\"FPS\":","\"\",","\"pos\":","[],","\"rot\":","[]","} ","",""]
[null,null,null,null," ","{","","\"FPS\":","\"\",","\"pos\":","[],","\"rot\":","[]","} ","",""]
[null,null,null,null," ","{","","\"FPS\":","\"\",","\"pos\":","[],","\"rot\":","[]","} ","",""]
[null,null,null,null," ","{","","\"FPS\":","\"\",","\"pos\":","[],","\"rot\":","[]","} ","",""]
[null,null,null,null," ","{","","\"FPS\":","\"\",","\"pos\":","[],","\"rot\":","[]","} ","",""]
[null,null,null,null," ","{","","\"FPS\":","\"\",","\"pos\":","[],","\"rot\":","[]","} ","",""]
[null,null,null,null," ","{","","\"FPS\":","\"\",","\"pos\":","[],","\"rot\":","[]","} ","",""]
[null,null,null,null," ","{","","\"FPS\":","\"\",","\"pos\":","[],","\"rot\":","[]","} ","",""]
[null,null,null,null," ","{","","\"FPS\":","\"\",","\"pos\":","[],","\"rot\":","[]","} ","",""]
[null,null,null,null," ","{","","\"FPS\":","\"\",","\"pos\":","[],","\"rot\":","[]","} ","",""]
[null,null,null,null," ","{","","\"FPS\":","\"\",","\"pos\":","[],","\"rot\":","[]","} ","",""]
[null,null,null,null," ","{",{"$f":"IF(A389<>\"\",CONCATENATE(\"\"\"\",A$3,\"\"\": \"\"\",A389,\"\"\", \"),\"\")","v":""},"\"FPS\":",{"$f":"CONCATENATE(\"\"\"\",B389,\"\"\"\",\",\")","v":"\"\","},"\"pos\":",{"$f":"CONCATENATE(\"[\",C389,\"]\",\",\")","v":"[],"},"\"rot\":",{"$f":"CONCATENATE(\"[\",D389,\"]\")","v":"[]"},"} ",{"$f":"IF(A389<>\"\",CONCATENATE(F389,G389,H389,I389,J389,K389,L389,M389,N389),\"\")","v":""},{"$f":"CONCATENATE(IF(AND(P388<>\"\",Q388=\"\"),CONCATENATE(P388,IF(A389<>\"\",\",\",\"\")),\"\"),O389)","v":""}]
[null,null,null,null," ","{","","\"FPS\":","\"\",","\"pos\":","[],","\"rot\":","[]","} ","",""]
[null,null,null,null," ","{","","\"FPS\":","\"\",","\"pos\":","[],","\"rot\":","[]","} ","",""]
[null,null,null,null," ","{","","\"FPS\":","\"\",","\"pos\":","[],","\"rot\":","[]","} ","",""]
[null,null,null,null," ","{","","\"FPS\":","\"\",","\"pos\":","[],","\"rot\":","[]","} ","",""]
[null,null,null,null," ","{","","\"FPS\":","\"\",","\"pos\":","[],","\"rot\":","[]","} ","",""]
[null,null,null,null," ","{","","\"FPS\":","\"\",","\"pos\":","[],","\"rot\":","[]","} ","",""]
[null,null,null,null," ","{","","\"FPS\":","\"\",","\"pos\":","[],","\"rot\":","[]","} ","",""]
[null,null,null,null," ","{","","\"FPS\":","\"\",","\"pos\":","[],","\"rot\":","[]","} ","",""]
[null,null,null,null," ","{","","\"FPS\":","\"\",","\"pos\":","[],","\"rot\":","[]","} ","",""]
[null,null,null,null," ","{","","\"FPS\":","\"\",","\"pos\":","[],","\"rot\":","[]","} ","",""]
[null,null,null,null," ","{","","\"FPS\":","\"\",","\"pos\":","[],","\"rot\":","[]","} ","",""]
[null,null,null,null," ","{","","\"FPS\":","\"\",","\"pos\":","[],","\"rot\":","[]","} ","",""]
[null,null,null,null," ","{","","\"FPS\":","\"\",","\"pos\":","[],","\"rot\":","[]","} ","",""]
[null,null,null,null," ","{","","\"FPS\":","\"\",","\"pos\":","[],","\"rot\":","[]","} ","",""]
[null,null,null,null," ","{","","\"FPS\":","\"\",","\"pos\":","[],","\"rot\":","[]","} ","",""]
[null,null,null,null," ","{","","\"FPS\":","\"\",","\"pos\":","[],","\"rot\":","[]","} ","",""]
[null,null,null,null," ","{","","\"FPS\":","\"\",","\"pos\":","[],","\"rot\":","[]","} ","",""]
[null,null,null,null," ","{","","\"FPS\":","\"\",","\"pos\":","[],","\"rot\":","[]","} ","",""]
[null,null,null,null," ","{","","\"FPS\":","\"\",","\"pos\":","[],","\"rot\":","[]","} ","",""]
[null,null,null,null," ","{","","\"FPS\":","\"\",","\"pos\":","[],","\"rot\":","[]","} ","",""]
[null,null,null,null," ","{","","\"FPS\":","\"\",","\"pos\":","[],","\"rot\":","[]","} ","",""]
[null,null,null,null," ","{","","\"FPS\":","\"\",","\"pos\":","[],","\"rot\":","[]","} ","",""]
[null,null,null,null," ","{","","\"FPS\":","\"\",","\"pos\":","[],","\"rot\":","[]","} ","",""]
[null,null,null,null," ","{","","\"FPS\":","\"\",","\"pos\":","[],","\"rot\":","[]","} ","",""]
[null,null,null,null," ","{","","\"FPS\":","\"\",","\"pos\":","[],","\"rot\":","[]","} ","",""]
[null,null,null,null," ","{","","\"FPS\":","\"\",","\"pos\":","[],","\"rot\":","[]","} ","",""]
[null,null,null,null," ","{","","\"FPS\":","\"\",","\"pos\":","[],","\"rot\":","[]","} ","",""]
[null,null,null,null," ","{","","\"FPS\":","\"\",","\"pos\":","[],","\"rot\":","[]","} ","",""]
[null,null,null,null," ","{","","\"FPS\":","\"\",","\"pos\":","[],","\"rot\":","[]","} ","",""]
[null,null,null,null," ","{","","\"FPS\":","\"\",","\"pos\":","[],","\"rot\":","[]","} ","",""]
[null,null,null,null," ","{","","\"FPS\":","\"\",","\"pos\":","[],","\"rot\":","[]","} ","",""]
[null,null,null,null," ","{","","\"FPS\":","\"\",","\"pos\":","[],","\"rot\":","[]","} ","",""]
[null,null,null,null," ","{","","\"FPS\":","\"\",","\"pos\":","[],","\"rot\":","[]","} ","",""]
[null,null,null,null," ","{","","\"FPS\":","\"\",","\"pos\":","[],","\"rot\":","[]","} ","",""]
[null,null,null,null," ","{","","\"FPS\":","\"\",","\"pos\":","[],","\"rot\":","[]","} ","",""]
[null,null,null,null," ","{","","\"FPS\":","\"\",","\"pos\":","[],","\"rot\":","[]","} ","",""]
[null,null,null,null," ","{","","\"FPS\":","\"\",","\"pos\":","[],","\"rot\":","[]","} ","",""]
[null,null,null,null," ","{","","\"FPS\":","\"\",","\"pos\":","[],","\"rot\":","[]","} ","",""]
[null,null,null,null," ","{","","\"FPS\":","\"\",","\"pos\":","[],","\"rot\":","[]","} ","",""]
[null,null,null,null," ","{","","\"FPS\":","\"\",","\"pos\":","[],","\"rot\":","[]","} ","",""]
[null,null,null,null," ","{","","\"FPS\":","\"\",","\"pos\":","[],","\"rot\":","[]","} ","",""]
[null,null,null,null," ","{","","\"FPS\":","\"\",","\"pos\":","[],","\"rot\":","[]","} ","",""]
[null,null,null,null," ","{","","\"FPS\":","\"\",","\"pos\":","[],","\"rot\":","[]","} ","",""]
[null,null,null,null," ","{","","\"FPS\":","\"\",","\"pos\":","[],","\"rot\":","[]","} ","",""]
[null,null,null,null," ","{","","\"FPS\":","\"\",","\"pos\":","[],","\"rot\":","[]","} ","",""]
[null,null,null,null," ","{","","\"FPS\":","\"\",","\"pos\":","[],","\"rot\":","[]","} ","",""]
[null,null,null,null," ","{","","\"FPS\":","\"\",","\"pos\":","[],","\"rot\":","[]","} ","",""]
[null,null,null,null," ","{","","\"FPS\":","\"\",","\"pos\":","[],","\"rot\":","[]","} ","",""]
[null,null,null,null," ","{","","\"FPS\":","\"\",","\"pos\":","[],","\"rot\":","[]","} ","",""]
[null,null,null,null," ","{","","\"FPS\":","\"\",","\"pos\":","[],","\"rot\":","[]","} ","",""]
[null,null,null,null," ","{","","\"FPS\":","\"\",","\"pos\":","[],","\"rot\":","[]","} ","",""]
[null,null,null,null," ","{","","\"FPS\":","\"\",","\"pos\":","[],","\"rot\":","[]","} ","",""]
[null,null,null,null," ","{","","\"FPS\":","\"\",","\"pos\":","[],","\"rot\":","[]","} ","",""]
[null,null,null,null," ","{","","\"FPS\":","\"\",","\"pos\":","[],","\"rot\":","[]","} ","",""]
[null,null,null,null," ","{","","\"FPS\":","\"\",","\"pos\":","[],","\"rot\":","[]","} ","",""]
[null,null,null,null," ","{","","\"FPS\":","\"\",","\"pos\":","[],","\"rot\":","[]","} ","",""]
[null,null,null,null," ","{","","\"FPS\":","\"\",","\"pos\":","[],","\"rot\":","[]","} ","",""]
[null,null,null,null," ","{","","\"FPS\":","\"\",","\"pos\":","[],","\"rot\":","[]","} ","",""]
[null,null,null,null," ","{","","\"FPS\":","\"\",","\"pos\":","[],","\"rot\":","[]","} ","",""]
[null,null,null,null," ","{","","\"FPS\":","\"\",","\"pos\":","[],","\"rot\":","[]","} ","",""]
[null,null,null,null," ","{","","\"FPS\":","\"\",","\"pos\":","[],","\"rot\":","[]","} ","",""]
[null,null,null,null," ","{","","\"FPS\":","\"\",","\"pos\":","[],","\"rot\":","[]","} ","",""]
[null,null,null,null," ","{","","\"FPS\":","\"\",","\"pos\":","[],","\"rot\":","[]","} ","",""]
[null,null,null,null," ","{",{"$f":"IF(A453<>\"\",CONCATENATE(\"\"\"\",A$3,\"\"\": \"\"\",A453,\"\"\", \"),\"\")","v":""},"\"FPS\":",{"$f":"CONCATENATE(\"\"\"\",B453,\"\"\"\",\",\")","v":"\"\","},"\"pos\":",{"$f":"CONCATENATE(\"[\",C453,\"]\",\",\")","v":"[],"},"\"rot\":",{"$f":"CONCATENATE(\"[\",D453,\"]\")","v":"[]"},"} ",{"$f":"IF(A453<>\"\",CONCATENATE(F453,G453,H453,I453,J453,K453,L453,M453,N453),\"\")","v":""},{"$f":"CONCATENATE(IF(AND(P452<>\"\",Q452=\"\"),CONCATENATE(P452,IF(A453<>\"\",\",\",\"\")),\"\"),O453)","v":""}]
[null,null,null,null," ","{","","\"FPS\":","\"\",","\"pos\":","[],","\"rot\":","[]","} ","",""]
[null,null,null,null," ","{","","\"FPS\":","\"\",","\"pos\":","[],","\"rot\":","[]","} ","",""]
[null,null,null,null," ","{","","\"FPS\":","\"\",","\"pos\":","[],","\"rot\":","[]","} ","",""]
[null,null,null,null," ","{","","\"FPS\":","\"\",","\"pos\":","[],","\"rot\":","[]","} ","",""]
[null,null,null,null," ","{","","\"FPS\":","\"\",","\"pos\":","[],","\"rot\":","[]","} ","",""]
[null,null,null,null," ","{","","\"FPS\":","\"\",","\"pos\":","[],","\"rot\":","[]","} ","",""]
[null,null,null,null," ","{","","\"FPS\":","\"\",","\"pos\":","[],","\"rot\":","[]","} ","",""]
[null,null,null,null," ","{","","\"FPS\":","\"\",","\"pos\":","[],","\"rot\":","[]","} ","",""]
[null,null,null,null," ","{","","\"FPS\":","\"\",","\"pos\":","[],","\"rot\":","[]","} ","",""]
[null,null,null,null," ","{","","\"FPS\":","\"\",","\"pos\":","[],","\"rot\":","[]","} ","",""]
[null,null,null,null," ","{","","\"FPS\":","\"\",","\"pos\":","[],","\"rot\":","[]","} ","",""]
[null,null,null,null," ","{","","\"FPS\":","\"\",","\"pos\":","[],","\"rot\":","[]","} ","",""]
[null,null,null,null," ","{","","\"FPS\":","\"\",","\"pos\":","[],","\"rot\":","[]","} ","",""]
[null,null,null,null," ","{","","\"FPS\":","\"\",","\"pos\":","[],","\"rot\":","[]","} ","",""]
[null,null,null,null," ","{","","\"FPS\":","\"\",","\"pos\":","[],","\"rot\":","[]","} ","",""]
[null,null,null,null," ","{","","\"FPS\":","\"\",","\"pos\":","[],","\"rot\":","[]","} ","",""]
[null,null,null,null," ","{","","\"FPS\":","\"\",","\"pos\":","[],","\"rot\":","[]","} ","",""]
[null,null,null,null," ","{","","\"FPS\":","\"\",","\"pos\":","[],","\"rot\":","[]","} ","",""]
[null,null,null,null," ","{","","\"FPS\":","\"\",","\"pos\":","[],","\"rot\":","[]","} ","",""]
[null,null,null,null," ","{","","\"FPS\":","\"\",","\"pos\":","[],","\"rot\":","[]","} ","",""]
[null,null,null,null," ","{","","\"FPS\":","\"\",","\"pos\":","[],","\"rot\":","[]","} ","",""]
[null,null,null,null," ","{","","\"FPS\":","\"\",","\"pos\":","[],","\"rot\":","[]","} ","",""]
[null,null,null,null," ","{","","\"FPS\":","\"\",","\"pos\":","[],","\"rot\":","[]","} ","",""]
[null,null,null,null," ","{","","\"FPS\":","\"\",","\"pos\":","[],","\"rot\":","[]","} ","",""]
[null,null,null,null," ","{","","\"FPS\":","\"\",","\"pos\":","[],","\"rot\":","[]","} ","",""]
[null,null,null,null," ","{","","\"FPS\":","\"\",","\"pos\":","[],","\"rot\":","[]","} ","",""]
[null,null,null,null," ","{","","\"FPS\":","\"\",","\"pos\":","[],","\"rot\":","[]","} ","",""]
[null,null,null,null," ","{","","\"FPS\":","\"\",","\"pos\":","[],","\"rot\":","[]","} ","",""]
[null,null,null,null," ","{","","\"FPS\":","\"\",","\"pos\":","[],","\"rot\":","[]","} ","",""]
[null,null,null,null," ","{","","\"FPS\":","\"\",","\"pos\":","[],","\"rot\":","[]","} ","",""]
[null,null,null,null," ","{","","\"FPS\":","\"\",","\"pos\":","[],","\"rot\":","[]","} ","",""]
[null,null,null,null," ","{","","\"FPS\":","\"\",","\"pos\":","[],","\"rot\":","[]","} ","",""]
[null,null,null,null," ","{","","\"FPS\":","\"\",","\"pos\":","[],","\"rot\":","[]","} ","",""]
[null,null,null,null," ","{","","\"FPS\":","\"\",","\"pos\":","[],","\"rot\":","[]","} ","",""]
[null,null,null,null," ","{","","\"FPS\":","\"\",","\"pos\":","[],","\"rot\":","[]","} ","",""]
[null,null,null,null," ","{","","\"FPS\":","\"\",","\"pos\":","[],","\"rot\":","[]","} ","",""]
[null,null,null,null," ","{","","\"FPS\":","\"\",","\"pos\":","[],","\"rot\":","[]","} ","",""]
[null,null,null,null," ","{","","\"FPS\":","\"\",","\"pos\":","[],","\"rot\":","[]","} ","",""]
[null,null,null,null," ","{","","\"FPS\":","\"\",","\"pos\":","[],","\"rot\":","[]","} ","",""]
[null,null,null,null," ","{","","\"FPS\":","\"\",","\"pos\":","[],","\"rot\":","[]","} ","",""]
[null,null,null,null," ","{","","\"FPS\":","\"\",","\"pos\":","[],","\"rot\":","[]","} ","",""]
[null,null,null,null," ","{","","\"FPS\":","\"\",","\"pos\":","[],","\"rot\":","[]","} ","",""]
[null,null,null,null," ","{","","\"FPS\":","\"\",","\"pos\":","[],","\"rot\":","[]","} ","",""]
[null,null,null,null," ","{","","\"FPS\":","\"\",","\"pos\":","[],","\"rot\":","[]","} ","",""]
[null,null,null,null," ","{","","\"FPS\":","\"\",","\"pos\":","[],","\"rot\":","[]","} ","",""]
[null,null,null,null," ","{","","\"FPS\":","\"\",","\"pos\":","[],","\"rot\":","[]","} ","",""]
[null,null,null,null," ","{","","\"FPS\":","\"\",","\"pos\":","[],","\"rot\":","[]","} ","",""]
[null,null,null,null," ","{","","\"FPS\":","\"\",","\"pos\":","[],","\"rot\":","[]","} ","",""]
[null,null,null,null," ","{","","\"FPS\":","\"\",","\"pos\":","[],","\"rot\":","[]","} ","",""]
[null,null,null,null," ","{","","\"FPS\":","\"\",","\"pos\":","[],","\"rot\":","[]","} ","",""]
[null,null,null,null," ","{","","\"FPS\":","\"\",","\"pos\":","[],","\"rot\":","[]","} ","",""]
[null,null,null,null," ","{","","\"FPS\":","\"\",","\"pos\":","[],","\"rot\":","[]","} ","",""]
[null,null,null,null," ","{","","\"FPS\":","\"\",","\"pos\":","[],","\"rot\":","[]","} ","",""]
[null,null,null,null," ","{","","\"FPS\":","\"\",","\"pos\":","[],","\"rot\":","[]","} ","",""]
[null,null,null,null," ","{","","\"FPS\":","\"\",","\"pos\":","[],","\"rot\":","[]","} ","",""]
[null,null,null,null," ","{","","\"FPS\":","\"\",","\"pos\":","[],","\"rot\":","[]","} ","",""]
[null,null,null,null," ","{","","\"FPS\":","\"\",","\"pos\":","[],","\"rot\":","[]","} ","",""]
[null,null,null,null," ","{","","\"FPS\":","\"\",","\"pos\":","[],","\"rot\":","[]","} ","",""]
[null,null,null,null," ","{","","\"FPS\":","\"\",","\"pos\":","[],","\"rot\":","[]","} ","",""]
[null,null,null,null," ","{","","\"FPS\":","\"\",","\"pos\":","[],","\"rot\":","[]","} ","",""]
[null,null,null,null," ","{","","\"FPS\":","\"\",","\"pos\":","[],","\"rot\":","[]","} ","",""]
[null,null,null,null," ","{","","\"FPS\":","\"\",","\"pos\":","[],","\"rot\":","[]","} ","",""]
[null,null,null,null," ","{","","\"FPS\":","\"\",","\"pos\":","[],","\"rot\":","[]","} ","",""]
[null,null,null,null," ","{",{"$f":"IF(A517<>\"\",CONCATENATE(\"\"\"\",A$3,\"\"\": \"\"\",A517,\"\"\", \"),\"\")","v":""},"\"FPS\":",{"$f":"CONCATENATE(\"\"\"\",B517,\"\"\"\",\",\")","v":"\"\","},"\"pos\":",{"$f":"CONCATENATE(\"[\",C517,\"]\",\",\")","v":"[],"},"\"rot\":",{"$f":"CONCATENATE(\"[\",D517,\"]\")","v":"[]"},"} ",{"$f":"IF(A517<>\"\",CONCATENATE(F517,G517,H517,I517,J517,K517,L517,M517,N517),\"\")","v":""},{"$f":"CONCATENATE(IF(AND(P516<>\"\",Q516=\"\"),CONCATENATE(P516,IF(A517<>\"\",\",\",\"\")),\"\"),O517)","v":""}]
[null,null,null,null," ","{","","\"FPS\":","\"\",","\"pos\":","[],","\"rot\":","[]","} ","",""]
[null,null,null,null," ","{","","\"FPS\":","\"\",","\"pos\":","[],","\"rot\":","[]","} ","",""]
[null,null,null,null," ","{","","\"FPS\":","\"\",","\"pos\":","[],","\"rot\":","[]","} ","",""]
[null,null,null,null," ","{","","\"FPS\":","\"\",","\"pos\":","[],","\"rot\":","[]","} ","",""]
[null,null,null,null," ","{","","\"FPS\":","\"\",","\"pos\":","[],","\"rot\":","[]","} ","",""]
[null,null,null,null," ","{","","\"FPS\":","\"\",","\"pos\":","[],","\"rot\":","[]","} ","",""]
[null,null,null,null," ","{","","\"FPS\":","\"\",","\"pos\":","[],","\"rot\":","[]","} ","",""]
[null,null,null,null," ","{","","\"FPS\":","\"\",","\"pos\":","[],","\"rot\":","[]","} ","",""]
[null,null,null,null," ","{","","\"FPS\":","\"\",","\"pos\":","[],","\"rot\":","[]","} ","",""]
[null,null,null,null," ","{","","\"FPS\":","\"\",","\"pos\":","[],","\"rot\":","[]","} ","",""]
[null,null,null,null," ","{","","\"FPS\":","\"\",","\"pos\":","[],","\"rot\":","[]","} ","",""]
[null,null,null,null," ","{","","\"FPS\":","\"\",","\"pos\":","[],","\"rot\":","[]","} ","",""]
[null,null,null,null," ","{","","\"FPS\":","\"\",","\"pos\":","[],","\"rot\":","[]","} ","",""]
[null,null,null,null," ","{","","\"FPS\":","\"\",","\"pos\":","[],","\"rot\":","[]","} ","",""]
[null,null,null,null," ","{","","\"FPS\":","\"\",","\"pos\":","[],","\"rot\":","[]","} ","",""]
[null,null,null,null," ","{","","\"FPS\":","\"\",","\"pos\":","[],","\"rot\":","[]","} ","",""]
[null,null,null,null," ","{","","\"FPS\":","\"\",","\"pos\":","[],","\"rot\":","[]","} ","",""]
[null,null,null,null," ","{","","\"FPS\":","\"\",","\"pos\":","[],","\"rot\":","[]","} ","",""]
[null,null,null,null," ","{","","\"FPS\":","\"\",","\"pos\":","[],","\"rot\":","[]","} ","",""]
[null,null,null,null," ","{","","\"FPS\":","\"\",","\"pos\":","[],","\"rot\":","[]","} ","",""]
[null,null,null,null," ","{","","\"FPS\":","\"\",","\"pos\":","[],","\"rot\":","[]","} ","",""]
[null,null,null,null," ","{","","\"FPS\":","\"\",","\"pos\":","[],","\"rot\":","[]","} ","",""]
[null,null,null,null," ","{","","\"FPS\":","\"\",","\"pos\":","[],","\"rot\":","[]","} ","",""]
[null,null,null,null," ","{","","\"FPS\":","\"\",","\"pos\":","[],","\"rot\":","[]","} ","",""]
[null,null,null,null," ","{","","\"FPS\":","\"\",","\"pos\":","[],","\"rot\":","[]","} ","",""]
[null,null,null,null," ","{","","\"FPS\":","\"\",","\"pos\":","[],","\"rot\":","[]","} ","",""]
[null,null,null,null," ","{","","\"FPS\":","\"\",","\"pos\":","[],","\"rot\":","[]","} ","",""]
[null,null,null,null," ","{","","\"FPS\":","\"\",","\"pos\":","[],","\"rot\":","[]","} ","",""]
[null,null,null,null," ","{","","\"FPS\":","\"\",","\"pos\":","[],","\"rot\":","[]","} ","",""]
[null,null,null,null," ","{","","\"FPS\":","\"\",","\"pos\":","[],","\"rot\":","[]","} ","",""]
[null,null,null,null," ","{","","\"FPS\":","\"\",","\"pos\":","[],","\"rot\":","[]","} ","",""]
[null,null,null,null," ","{","","\"FPS\":","\"\",","\"pos\":","[],","\"rot\":","[]","} ","",""]
[null,null,null,null," ","{","","\"FPS\":","\"\",","\"pos\":","[],","\"rot\":","[]","} ","",""]
[null,null,null,null," ","{","","\"FPS\":","\"\",","\"pos\":","[],","\"rot\":","[]","} ","",""]
[null,null,null,null," ","{","","\"FPS\":","\"\",","\"pos\":","[],","\"rot\":","[]","} ","",""]
[null,null,null,null," ","{","","\"FPS\":","\"\",","\"pos\":","[],","\"rot\":","[]","} ","",""]
[null,null,null,null," ","{","","\"FPS\":","\"\",","\"pos\":","[],","\"rot\":","[]","} ","",""]
[null,null,null,null," ","{","","\"FPS\":","\"\",","\"pos\":","[],","\"rot\":","[]","} ","",""]
[null,null,null,null," ","{","","\"FPS\":","\"\",","\"pos\":","[],","\"rot\":","[]","} ","",""]
[null,null,null,null," ","{","","\"FPS\":","\"\",","\"pos\":","[],","\"rot\":","[]","} ","",""]
[null,null,null,null," ","{","","\"FPS\":","\"\",","\"pos\":","[],","\"rot\":","[]","} ","",""]
[null,null,null,null," ","{","","\"FPS\":","\"\",","\"pos\":","[],","\"rot\":","[]","} ","",""]
[null,null,null,null," ","{","","\"FPS\":","\"\",","\"pos\":","[],","\"rot\":","[]","} ","",""]
[null,null,null,null," ","{","","\"FPS\":","\"\",","\"pos\":","[],","\"rot\":","[]","} ","",""]
[null,null,null,null," ","{","","\"FPS\":","\"\",","\"pos\":","[],","\"rot\":","[]","} ","",""]
[null,null,null,null," ","{","","\"FPS\":","\"\",","\"pos\":","[],","\"rot\":","[]","} ","",""]
[null,null,null,null," ","{","","\"FPS\":","\"\",","\"pos\":","[],","\"rot\":","[]","} ","",""]
[null,null,null,null," ","{","","\"FPS\":","\"\",","\"pos\":","[],","\"rot\":","[]","} ","",""]
[null,null,null,null," ","{","","\"FPS\":","\"\",","\"pos\":","[],","\"rot\":","[]","} ","",""]
[null,null,null,null," ","{","","\"FPS\":","\"\",","\"pos\":","[],","\"rot\":","[]","} ","",""]
[null,null,null,null," ","{","","\"FPS\":","\"\",","\"pos\":","[],","\"rot\":","[]","} ","",""]
[null,null,null,null," ","{","","\"FPS\":","\"\",","\"pos\":","[],","\"rot\":","[]","} ","",""]
[null,null,null,null," ","{","","\"FPS\":","\"\",","\"pos\":","[],","\"rot\":","[]","} ","",""]
[null,null,null,null," ","{","","\"FPS\":","\"\",","\"pos\":","[],","\"rot\":","[]","} ","",""]
[null,null,null,null," ","{","","\"FPS\":","\"\",","\"pos\":","[],","\"rot\":","[]","} ","",""]
[null,null,null,null," ","{","","\"FPS\":","\"\",","\"pos\":","[],","\"rot\":","[]","} ","",""]
[null,null,null,null," ","{","","\"FPS\":","\"\",","\"pos\":","[],","\"rot\":","[]","} ","",""]
[null,null,null,null," ","{","","\"FPS\":","\"\",","\"pos\":","[],","\"rot\":","[]","} ","",""]
[null,null,null,null," ","{","","\"FPS\":","\"\",","\"pos\":","[],","\"rot\":","[]","} ","",""]
[null,null,null,null," ","{","","\"FPS\":","\"\",","\"pos\":","[],","\"rot\":","[]","} ","",""]
[null,null,null,null," ","{","","\"FPS\":","\"\",","\"pos\":","[],","\"rot\":","[]","} ","",""]
[null,null,null,null," ","{","","\"FPS\":","\"\",","\"pos\":","[],","\"rot\":","[]","} ","",""]
[null,null,null,null," ","{","","\"FPS\":","\"\",","\"pos\":","[],","\"rot\":","[]","} ","",""]
[null,null,null,null," ","{",{"$f":"IF(A581<>\"\",CONCATENATE(\"\"\"\",A$3,\"\"\": \"\"\",A581,\"\"\", \"),\"\")","v":""},"\"FPS\":",{"$f":"CONCATENATE(\"\"\"\",B581,\"\"\"\",\",\")","v":"\"\","},"\"pos\":",{"$f":"CONCATENATE(\"[\",C581,\"]\",\",\")","v":"[],"},"\"rot\":",{"$f":"CONCATENATE(\"[\",D581,\"]\")","v":"[]"},"} ",{"$f":"IF(A581<>\"\",CONCATENATE(F581,G581,H581,I581,J581,K581,L581,M581,N581),\"\")","v":""},{"$f":"CONCATENATE(IF(AND(P580<>\"\",Q580=\"\"),CONCATENATE(P580,IF(A581<>\"\",\",\",\"\")),\"\"),O581)","v":""}]
[null,null,null,null," ","{","","\"FPS\":","\"\",","\"pos\":","[],","\"rot\":","[]","} ","",""]
[null,null,null,null," ","{","","\"FPS\":","\"\",","\"pos\":","[],","\"rot\":","[]","} ","",""]
[null,null,null,null," ","{","","\"FPS\":","\"\",","\"pos\":","[],","\"rot\":","[]","} ","",""]
[null,null,null,null," ","{","","\"FPS\":","\"\",","\"pos\":","[],","\"rot\":","[]","} ","",""]
[null,null,null,null," ","{","","\"FPS\":","\"\",","\"pos\":","[],","\"rot\":","[]","} ","",""]
[null,null,null,null," ","{","","\"FPS\":","\"\",","\"pos\":","[],","\"rot\":","[]","} ","",""]
[null,null,null,null," ","{","","\"FPS\":","\"\",","\"pos\":","[],","\"rot\":","[]","} ","","",3]
[null,null,null,null," ","{","","\"FPS\":","\"\",","\"pos\":","[],","\"rot\":","[]","} ","",""]
[null,null,null,null," ","{","","\"FPS\":","\"\",","\"pos\":","[],","\"rot\":","[]","} ","",""]
[null,null,null,null," ","{","","\"FPS\":","\"\",","\"pos\":","[],","\"rot\":","[]","} ","",""]
[null,null,null,null," ","{","","\"FPS\":","\"\",","\"pos\":","[],","\"rot\":","[]","} ","",""]
[null,null,null,null," ","{","","\"FPS\":","\"\",","\"pos\":","[],","\"rot\":","[]","} ","",""]
[null,null,null,null," ","{","","\"FPS\":","\"\",","\"pos\":","[],","\"rot\":","[]","} ","",""]
[null,null,null,null," ","{","","\"FPS\":","\"\",","\"pos\":","[],","\"rot\":","[]","} ","",""]
[null,null,null,null," ","{","","\"FPS\":","\"\",","\"pos\":","[],","\"rot\":","[]","} ","",""]
[null,null,null,null," ","{","","\"FPS\":","\"\",","\"pos\":","[],","\"rot\":","[]","} ","",""]
[null,null,null,null," ","{","","\"FPS\":","\"\",","\"pos\":","[],","\"rot\":","[]","} ","",""]
[null,null,null,null," ","{","","\"FPS\":","\"\",","\"pos\":","[],","\"rot\":","[]","} ","",""]
[null,null,null,null," ","{","","\"FPS\":","\"\",","\"pos\":","[],","\"rot\":","[]","} ","",""]
[null,null,null,null," ","{","","\"FPS\":","\"\",","\"pos\":","[],","\"rot\":","[]","} ","",""]
[null,null,null,null," ","{","","\"FPS\":","\"\",","\"pos\":","[],","\"rot\":","[]","} ","",""]
[null,null,null,null," ","{","","\"FPS\":","\"\",","\"pos\":","[],","\"rot\":","[]","} ","",""]
[null,null,null,null," ","{","","\"FPS\":","\"\",","\"pos\":","[],","\"rot\":","[]","} ","",""]
[null,null,null,null," ","{","","\"FPS\":","\"\",","\"pos\":","[],","\"rot\":","[]","} ","",""]
[null,null,null,null," ","{","","\"FPS\":","\"\",","\"pos\":","[],","\"rot\":","[]","} ","",""]
[null,null,null,null," ","{","","\"FPS\":","\"\",","\"pos\":","[],","\"rot\":","[]","} ","",""]
[null,null,null,null," ","{","","\"FPS\":","\"\",","\"pos\":","[],","\"rot\":","[]","} ","",""]
[null,null,null,null," ","{","","\"FPS\":","\"\",","\"pos\":","[],","\"rot\":","[]","} ","",""]
[null,null,null,null," ","{","","\"FPS\":","\"\",","\"pos\":","[],","\"rot\":","[]","} ","",""]
[null,null,null,null," ","{","","\"FPS\":","\"\",","\"pos\":","[],","\"rot\":","[]","} ","",""]
[null,null,null,null," ","{","","\"FPS\":","\"\",","\"pos\":","[],","\"rot\":","[]","} ","",""]
[null,null,null,null," ","{","","\"FPS\":","\"\",","\"pos\":","[],","\"rot\":","[]","} ","",""]
[null,null,null,null," ","{","","\"FPS\":","\"\",","\"pos\":","[],","\"rot\":","[]","} ","",""]
[null,null,null,null," ","{","","\"FPS\":","\"\",","\"pos\":","[],","\"rot\":","[]","} ","",""]
[null,null,null,null," ","{","","\"FPS\":","\"\",","\"pos\":","[],","\"rot\":","[]","} ","",""]
[null,null,null,null," ","{","","\"FPS\":","\"\",","\"pos\":","[],","\"rot\":","[]","} ","",""]
[null,null,null,null," ","{","","\"FPS\":","\"\",","\"pos\":","[],","\"rot\":","[]","} ","",""]
[null,null,null,null," ","{","","\"FPS\":","\"\",","\"pos\":","[],","\"rot\":","[]","} ","",""]
[null,null,null,null," ","{","","\"FPS\":","\"\",","\"pos\":","[],","\"rot\":","[]","} ","",""]
[null,null,null,null," ","{","","\"FPS\":","\"\",","\"pos\":","[],","\"rot\":","[]","} ","",""]
[null,null,null,null," ","{","","\"FPS\":","\"\",","\"pos\":","[],","\"rot\":","[]","} ","",""]
[null,null,null,null," ","{","","\"FPS\":","\"\",","\"pos\":","[],","\"rot\":","[]","} ","",""]
[null,null,null,null," ","{","","\"FPS\":","\"\",","\"pos\":","[],","\"rot\":","[]","} ","",""]
[null,null,null,null," ","{","","\"FPS\":","\"\",","\"pos\":","[],","\"rot\":","[]","} ","",""]
[null,null,null,null," ","{","","\"FPS\":","\"\",","\"pos\":","[],","\"rot\":","[]","} ","",""]
[null,null,null,null," ","{","","\"FPS\":","\"\",","\"pos\":","[],","\"rot\":","[]","} ","",""]
[null,null,null,null," ","{","","\"FPS\":","\"\",","\"pos\":","[],","\"rot\":","[]","} ","",""]
[null,null,null,null," ","{","","\"FPS\":","\"\",","\"pos\":","[],","\"rot\":","[]","} ","",""]
[null,null,null,null," ","{","","\"FPS\":","\"\",","\"pos\":","[],","\"rot\":","[]","} ","",""]
[null,null,null,null," ","{","","\"FPS\":","\"\",","\"pos\":","[],","\"rot\":","[]","} ","",""]
[null,null,null,null," ","{","","\"FPS\":","\"\",","\"pos\":","[],","\"rot\":","[]","} ","",""]
[null,null,null,null," ","{","","\"FPS\":","\"\",","\"pos\":","[],","\"rot\":","[]","} ","",""]
[null,null,null,null," ","{","","\"FPS\":","\"\",","\"pos\":","[],","\"rot\":","[]","} ","",""]
[null,null,null,null," ","{","","\"FPS\":","\"\",","\"pos\":","[],","\"rot\":","[]","} ","",""]
[null,null,null,null," ","{","","\"FPS\":","\"\",","\"pos\":","[],","\"rot\":","[]","} ","",""]
[null,null,null,null," ","{","","\"FPS\":","\"\",","\"pos\":","[],","\"rot\":","[]","} ","",""]
[null,null,null,null," ","{","","\"FPS\":","\"\",","\"pos\":","[],","\"rot\":","[]","} ","",""]
[null,null,null,null," ","{","","\"FPS\":","\"\",","\"pos\":","[],","\"rot\":","[]","} ","",""]
[null,null,null,null," ","{","","\"FPS\":","\"\",","\"pos\":","[],","\"rot\":","[]","} ","",""]
[null,null,null,null," ","{","","\"FPS\":","\"\",","\"pos\":","[],","\"rot\":","[]","} ","",""]
[null,null,null,null," ","{","","\"FPS\":","\"\",","\"pos\":","[],","\"rot\":","[]","} ","",""]
[null,null,null,null," ","{","","\"FPS\":","\"\",","\"pos\":","[],","\"rot\":","[]","} ","",""]
[null,null,null,null," ","{","","\"FPS\":","\"\",","\"pos\":","[],","\"rot\":","[]","} ","",""]
[null,null,null,null," ","{",{"$f":"IF(A645<>\"\",CONCATENATE(\"\"\"\",A$3,\"\"\": \"\"\",A645,\"\"\", \"),\"\")","v":""},"\"FPS\":",{"$f":"CONCATENATE(\"\"\"\",B645,\"\"\"\",\",\")","v":"\"\","},"\"pos\":",{"$f":"CONCATENATE(\"[\",C645,\"]\",\",\")","v":"[],"},"\"rot\":",{"$f":"CONCATENATE(\"[\",D645,\"]\")","v":"[]"},"} ",{"$f":"IF(A645<>\"\",CONCATENATE(F645,G645,H645,I645,J645,K645,L645,M645,N645),\"\")","v":""},{"$f":"CONCATENATE(IF(AND(P644<>\"\",Q644=\"\"),CONCATENATE(P644,IF(A645<>\"\",\",\",\"\")),\"\"),O645)","v":""}]
[null,null,null,null," ","{","","\"FPS\":","\"\",","\"pos\":","[],","\"rot\":","[]","} ","",""]
[null,null,null,null," ","{","","\"FPS\":","\"\",","\"pos\":","[],","\"rot\":","[]","} ","",""]
[null,null,null,null," ","{","","\"FPS\":","\"\",","\"pos\":","[],","\"rot\":","[]","} ","",""]
[null,null,null,null," ","{","","\"FPS\":","\"\",","\"pos\":","[],","\"rot\":","[]","} ","",""]
[null,null,null,null," ","{","","\"FPS\":","\"\",","\"pos\":","[],","\"rot\":","[]","} ","",""]
[null,null,null,null," ","{","","\"FPS\":","\"\",","\"pos\":","[],","\"rot\":","[]","} ","",""]
[null,null,null,null," ","{","","\"FPS\":","\"\",","\"pos\":","[],","\"rot\":","[]","} ","",""]
[null,null,null,null," ","{","","\"FPS\":","\"\",","\"pos\":","[],","\"rot\":","[]","} ","",""]
[null,null,null,null," ","{","","\"FPS\":","\"\",","\"pos\":","[],","\"rot\":","[]","} ","",""]
[null,null,null,null," ","{","","\"FPS\":","\"\",","\"pos\":","[],","\"rot\":","[]","} ","",""]
[null,null,null,null," ","{","","\"FPS\":","\"\",","\"pos\":","[],","\"rot\":","[]","} ","",""]
[null,null,null,null," ","{","","\"FPS\":","\"\",","\"pos\":","[],","\"rot\":","[]","} ","",""]
[null,null,null,null," ","{","","\"FPS\":","\"\",","\"pos\":","[],","\"rot\":","[]","} ","",""]
[null,null,null,null," ","{","","\"FPS\":","\"\",","\"pos\":","[],","\"rot\":","[]","} ","",""]
[null,null,null,null," ","{","","\"FPS\":","\"\",","\"pos\":","[],","\"rot\":","[]","} ","",""]
[null,null,null,null," ","{","","\"FPS\":","\"\",","\"pos\":","[],","\"rot\":","[]","} ","",""]
[null,null,null,null," ","{","","\"FPS\":","\"\",","\"pos\":","[],","\"rot\":","[]","} ","",""]
[null,null,null,null," ","{","","\"FPS\":","\"\",","\"pos\":","[],","\"rot\":","[]","} ","",""]
[null,null,null,null," ","{","","\"FPS\":","\"\",","\"pos\":","[],","\"rot\":","[]","} ","",""]
[null,null,null,null," ","{","","\"FPS\":","\"\",","\"pos\":","[],","\"rot\":","[]","} ","",""]
[null,null,null,null," ","{","","\"FPS\":","\"\",","\"pos\":","[],","\"rot\":","[]","} ","",""]
[null,null,null,null," ","{","","\"FPS\":","\"\",","\"pos\":","[],","\"rot\":","[]","} ","",""]
[null,null,null,null," ","{","","\"FPS\":","\"\",","\"pos\":","[],","\"rot\":","[]","} ","",""]
[null,null,null,null," ","{","","\"FPS\":","\"\",","\"pos\":","[],","\"rot\":","[]","} ","",""]
[null,null,null,null," ","{","","\"FPS\":","\"\",","\"pos\":","[],","\"rot\":","[]","} ","",""]
[null,null,null,null," ","{","","\"FPS\":","\"\",","\"pos\":","[],","\"rot\":","[]","} ","",""]
[null,null,null,null," ","{","","\"FPS\":","\"\",","\"pos\":","[],","\"rot\":","[]","} ","",""]
[null,null,null,null," ","{","","\"FPS\":","\"\",","\"pos\":","[],","\"rot\":","[]","} ","",""]
[null,null,null,null," ","{","","\"FPS\":","\"\",","\"pos\":","[],","\"rot\":","[]","} ","",""]
[null,null,null,null," ","{","","\"FPS\":","\"\",","\"pos\":","[],","\"rot\":","[]","} ","",""]
[null,null,null,null," ","{","","\"FPS\":","\"\",","\"pos\":","[],","\"rot\":","[]","} ","",""]
[null,null,null,null," ","{","","\"FPS\":","\"\",","\"pos\":","[],","\"rot\":","[]","} ","",""]
[null,null,null,null," ","{","","\"FPS\":","\"\",","\"pos\":","[],","\"rot\":","[]","} ","",""]
[null,null,null,null," ","{","","\"FPS\":","\"\",","\"pos\":","[],","\"rot\":","[]","} ","",""]
[null,null,null,null," ","{","","\"FPS\":","\"\",","\"pos\":","[],","\"rot\":","[]","} ","",""]
[null,null,null,null," ","{","","\"FPS\":","\"\",","\"pos\":","[],","\"rot\":","[]","} ","",""]
[null,null,null,null," ","{","","\"FPS\":","\"\",","\"pos\":","[],","\"rot\":","[]","} ","",""]
[null,null,null,null," ","{","","\"FPS\":","\"\",","\"pos\":","[],","\"rot\":","[]","} ","",""]
[null,null,null,null," ","{","","\"FPS\":","\"\",","\"pos\":","[],","\"rot\":","[]","} ","",""]
[null,null,null,null," ","{","","\"FPS\":","\"\",","\"pos\":","[],","\"rot\":","[]","} ","",""]
[null,null,null,null," ","{","","\"FPS\":","\"\",","\"pos\":","[],","\"rot\":","[]","} ","",""]
[null,null,null,null," ","{","","\"FPS\":","\"\",","\"pos\":","[],","\"rot\":","[]","} ","",""]
[null,null,null,null," ","{","","\"FPS\":","\"\",","\"pos\":","[],","\"rot\":","[]","} ","",""]
[null,null,null,null," ","{","","\"FPS\":","\"\",","\"pos\":","[],","\"rot\":","[]","} ","",""]
[null,null,null,null," ","{","","\"FPS\":","\"\",","\"pos\":","[],","\"rot\":","[]","} ","",""]
[null,null,null,null," ","{","","\"FPS\":","\"\",","\"pos\":","[],","\"rot\":","[]","} ","",""]
[null,null,null,null," ","{","","\"FPS\":","\"\",","\"pos\":","[],","\"rot\":","[]","} ","",""]
[null,null,null,null," ","{","","\"FPS\":","\"\",","\"pos\":","[],","\"rot\":","[]","} ","",""]
[null,null,null,null," ","{","","\"FPS\":","\"\",","\"pos\":","[],","\"rot\":","[]","} ","",""]
[null,null,null,null," ","{","","\"FPS\":","\"\",","\"pos\":","[],","\"rot\":","[]","} ","",""]
[null,null,null,null," ","{","","\"FPS\":","\"\",","\"pos\":","[],","\"rot\":","[]","} ","",""]
[null,null,null,null," ","{","","\"FPS\":","\"\",","\"pos\":","[],","\"rot\":","[]","} ","",""]
[null,null,null,null," ","{","","\"FPS\":","\"\",","\"pos\":","[],","\"rot\":","[]","} ","",""]
[null,null,null,null," ","{","","\"FPS\":","\"\",","\"pos\":","[],","\"rot\":","[]","} ","",""]
[null,null,null,null," ","{","","\"FPS\":","\"\",","\"pos\":","[],","\"rot\":","[]","} ","",""]
[null,null,null,null," ","{","","\"FPS\":","\"\",","\"pos\":","[],","\"rot\":","[]","} ","",""]
[null,null,null,null," ","{","","\"FPS\":","\"\",","\"pos\":","[],","\"rot\":","[]","} ","",""]
[null,null,null,null," ","{","","\"FPS\":","\"\",","\"pos\":","[],","\"rot\":","[]","} ","",""]
[null,null,null,null," ","{","","\"FPS\":","\"\",","\"pos\":","[],","\"rot\":","[]","} ","",""]
[null,null,null,null," ","{","","\"FPS\":","\"\",","\"pos\":","[],","\"rot\":","[]","} ","",""]
[null,null,null,null," ","{","","\"FPS\":","\"\",","\"pos\":","[],","\"rot\":","[]","} ","",""]
[null,null,null,null," ","{","","\"FPS\":","\"\",","\"pos\":","[],","\"rot\":","[]","} ","",""]
[null,null,null,null," ","{","","\"FPS\":","\"\",","\"pos\":","[],","\"rot\":","[]","} ","",""]
[null,null,null,null," ","{",{"$f":"IF(A709<>\"\",CONCATENATE(\"\"\"\",A$3,\"\"\": \"\"\",A709,\"\"\", \"),\"\")","v":""},"\"FPS\":",{"$f":"CONCATENATE(\"\"\"\",B709,\"\"\"\",\",\")","v":"\"\","},"\"pos\":",{"$f":"CONCATENATE(\"[\",C709,\"]\",\",\")","v":"[],"},"\"rot\":",{"$f":"CONCATENATE(\"[\",D709,\"]\")","v":"[]"},"} ",{"$f":"IF(A709<>\"\",CONCATENATE(F709,G709,H709,I709,J709,K709,L709,M709,N709),\"\")","v":""},{"$f":"CONCATENATE(IF(AND(P708<>\"\",Q708=\"\"),CONCATENATE(P708,IF(A709<>\"\",\",\",\"\")),\"\"),O709)","v":""}]
[null,null,null,null," ","{","","\"FPS\":","\"\",","\"pos\":","[],","\"rot\":","[]","} ","",""]
[null,null,null,null," ","{","","\"FPS\":","\"\",","\"pos\":","[],","\"rot\":","[]","} ","",""]
[null,null,null,null," ","{","","\"FPS\":","\"\",","\"pos\":","[],","\"rot\":","[]","} ","",""]
[null,null,null,null," ","{","","\"FPS\":","\"\",","\"pos\":","[],","\"rot\":","[]","} ","",""]
[null,null,null,null," ","{","","\"FPS\":","\"\",","\"pos\":","[],","\"rot\":","[]","} ","",""]
[null,null,null,null," ","{","","\"FPS\":","\"\",","\"pos\":","[],","\"rot\":","[]","} ","",""]
[null,null,null,null," ","{","","\"FPS\":","\"\",","\"pos\":","[],","\"rot\":","[]","} ","",""]
[null,null,null,null," ","{","","\"FPS\":","\"\",","\"pos\":","[],","\"rot\":","[]","} ","",""]
[null,null,null,null," ","{","","\"FPS\":","\"\",","\"pos\":","[],","\"rot\":","[]","} ","",""]
[null,null,null,null," ","{","","\"FPS\":","\"\",","\"pos\":","[],","\"rot\":","[]","} ","",""]
[null,null,null,null," ","{","","\"FPS\":","\"\",","\"pos\":","[],","\"rot\":","[]","} ","",""]
[null,null,null,null," ","{","","\"FPS\":","\"\",","\"pos\":","[],","\"rot\":","[]","} ","",""]
[null,null,null,null," ","{","","\"FPS\":","\"\",","\"pos\":","[],","\"rot\":","[]","} ","",""]
[null,null,null,null," ","{","","\"FPS\":","\"\",","\"pos\":","[],","\"rot\":","[]","} ","",""]
[null,null,null,null," ","{","","\"FPS\":","\"\",","\"pos\":","[],","\"rot\":","[]","} ","",""]
[null,null,null,null," ","{","","\"FPS\":","\"\",","\"pos\":","[],","\"rot\":","[]","} ","",""]
[null,null,null,null," ","{","","\"FPS\":","\"\",","\"pos\":","[],","\"rot\":","[]","} ","",""]
[null,null,null,null," ","{","","\"FPS\":","\"\",","\"pos\":","[],","\"rot\":","[]","} ","",""]
[null,null,null,null," ","{","","\"FPS\":","\"\",","\"pos\":","[],","\"rot\":","[]","} ","",""]
[null,null,null,null," ","{","","\"FPS\":","\"\",","\"pos\":","[],","\"rot\":","[]","} ","",""]
[null,null,null,null," ","{","","\"FPS\":","\"\",","\"pos\":","[],","\"rot\":","[]","} ","",""]
[null,null,null,null," ","{","","\"FPS\":","\"\",","\"pos\":","[],","\"rot\":","[]","} ","",""]
[null,null,null,null," ","{","","\"FPS\":","\"\",","\"pos\":","[],","\"rot\":","[]","} ","",""]
[null,null,null,null," ","{","","\"FPS\":","\"\",","\"pos\":","[],","\"rot\":","[]","} ","",""]
[null,null,null,null," ","{","","\"FPS\":","\"\",","\"pos\":","[],","\"rot\":","[]","} ","",""]
[null,null,null,null," ","{","","\"FPS\":","\"\",","\"pos\":","[],","\"rot\":","[]","} ","",""]
[null,null,null,null," ","{","","\"FPS\":","\"\",","\"pos\":","[],","\"rot\":","[]","} ","",""]
[null,null,null,null," ","{","","\"FPS\":","\"\",","\"pos\":","[],","\"rot\":","[]","} ","",""]
[null,null,null,null," ","{","","\"FPS\":","\"\",","\"pos\":","[],","\"rot\":","[]","} ","",""]
[null,null,null,null," ","{","","\"FPS\":","\"\",","\"pos\":","[],","\"rot\":","[]","} ","",""]
[null,null,null,null," ","{","","\"FPS\":","\"\",","\"pos\":","[],","\"rot\":","[]","} ","",""]
[null,null,null,null," ","{","","\"FPS\":","\"\",","\"pos\":","[],","\"rot\":","[]","} ","",""]
[null,null,null,null," ","{","","\"FPS\":","\"\",","\"pos\":","[],","\"rot\":","[]","} ","",""]
[null,null,null,null," ","{","","\"FPS\":","\"\",","\"pos\":","[],","\"rot\":","[]","} ","",""]
[null,null,null,null," ","{","","\"FPS\":","\"\",","\"pos\":","[],","\"rot\":","[]","} ","",""]
[null,null,null,null," ","{","","\"FPS\":","\"\",","\"pos\":","[],","\"rot\":","[]","} ","",""]
[null,null,null,null," ","{","","\"FPS\":","\"\",","\"pos\":","[],","\"rot\":","[]","} ","",""]
[null,null,null,null," ","{","","\"FPS\":","\"\",","\"pos\":","[],","\"rot\":","[]","} ","",""]
[null,null,null,null," ","{","","\"FPS\":","\"\",","\"pos\":","[],","\"rot\":","[]","} ","",""]
[null,null,null,null," ","{","","\"FPS\":","\"\",","\"pos\":","[],","\"rot\":","[]","} ","",""]
[null,null,null,null," ","{","","\"FPS\":","\"\",","\"pos\":","[],","\"rot\":","[]","} ","",""]
[null,null,null,null," ","{","","\"FPS\":","\"\",","\"pos\":","[],","\"rot\":","[]","} ","",""]
[null,null,null,null," ","{","","\"FPS\":","\"\",","\"pos\":","[],","\"rot\":","[]","} ","",""]
[null,null,null,null," ","{","","\"FPS\":","\"\",","\"pos\":","[],","\"rot\":","[]","} ","",""]
[null,null,null,null," ","{","","\"FPS\":","\"\",","\"pos\":","[],","\"rot\":","[]","} ","",""]
[null,null,null,null," ","{","","\"FPS\":","\"\",","\"pos\":","[],","\"rot\":","[]","} ","",""]
[null,null,null,null," ","{","","\"FPS\":","\"\",","\"pos\":","[],","\"rot\":","[]","} ","",""]
[null,null,null,null," ","{","","\"FPS\":","\"\",","\"pos\":","[],","\"rot\":","[]","} ","",""]
[null,null,null,null," ","{","","\"FPS\":","\"\",","\"pos\":","[],","\"rot\":","[]","} ","",""]
[null,null,null,null," ","{","","\"FPS\":","\"\",","\"pos\":","[],","\"rot\":","[]","} ","",""]
[null,null,null,null," ","{","","\"FPS\":","\"\",","\"pos\":","[],","\"rot\":","[]","} ","",""]
[null,null,null,null," ","{","","\"FPS\":","\"\",","\"pos\":","[],","\"rot\":","[]","} ","",""]
[null,null,null,null," ","{","","\"FPS\":","\"\",","\"pos\":","[],","\"rot\":","[]","} ","",""]
[null,null,null,null," ","{","","\"FPS\":","\"\",","\"pos\":","[],","\"rot\":","[]","} ","",""]
[null,null,null,null," ","{","","\"FPS\":","\"\",","\"pos\":","[],","\"rot\":","[]","} ","",""]
[null,null,null,null," ","{","","\"FPS\":","\"\",","\"pos\":","[],","\"rot\":","[]","} ","",""]
[null,null,null,null," ","{","","\"FPS\":","\"\",","\"pos\":","[],","\"rot\":","[]","} ","",""]
[null,null,null,null," ","{","","\"FPS\":","\"\",","\"pos\":","[],","\"rot\":","[]","} ","",""]
[null,null,null,null," ","{","","\"FPS\":","\"\",","\"pos\":","[],","\"rot\":","[]","} ","",""]
[null,null,null,null," ","{","","\"FPS\":","\"\",","\"pos\":","[],","\"rot\":","[]","} ","",""]
[null,null,null,null," ","{","","\"FPS\":","\"\",","\"pos\":","[],","\"rot\":","[]","} ","",""]
[null,null,null,null," ","{","","\"FPS\":","\"\",","\"pos\":","[],","\"rot\":","[]","} ","",""]
[null,null,null,null," ","{","","\"FPS\":","\"\",","\"pos\":","[],","\"rot\":","[]","} ","",""]
[null,null,null,null," ","{",{"$f":"IF(A773<>\"\",CONCATENATE(\"\"\"\",A$3,\"\"\": \"\"\",A773,\"\"\", \"),\"\")","v":""},"\"FPS\":",{"$f":"CONCATENATE(\"\"\"\",B773,\"\"\"\",\",\")","v":"\"\","},"\"pos\":",{"$f":"CONCATENATE(\"[\",C773,\"]\",\",\")","v":"[],"},"\"rot\":",{"$f":"CONCATENATE(\"[\",D773,\"]\")","v":"[]"},"} ",{"$f":"IF(A773<>\"\",CONCATENATE(F773,G773,H773,I773,J773,K773,L773,M773,N773),\"\")","v":""},{"$f":"CONCATENATE(IF(AND(P772<>\"\",Q772=\"\"),CONCATENATE(P772,IF(A773<>\"\",\",\",\"\")),\"\"),O773)","v":""}]
[null,null,null,null," ","{","","\"FPS\":","\"\",","\"pos\":","[],","\"rot\":","[]","} ","",""]
[null,null,null,null," ","{","","\"FPS\":","\"\",","\"pos\":","[],","\"rot\":","[]","} ","",""]
[null,null,null,null," ","{","","\"FPS\":","\"\",","\"pos\":","[],","\"rot\":","[]","} ","",""]
[null,null,null,null," ","{","","\"FPS\":","\"\",","\"pos\":","[],","\"rot\":","[]","} ","",""]
[null,null,null,null," ","{","","\"FPS\":","\"\",","\"pos\":","[],","\"rot\":","[]","} ","",""]
[null,null,null,null," ","{","","\"FPS\":","\"\",","\"pos\":","[],","\"rot\":","[]","} ","",""]
[null,null,null,null," ","{","","\"FPS\":","\"\",","\"pos\":","[],","\"rot\":","[]","} ","",""]
[null,null,null,null," ","{","","\"FPS\":","\"\",","\"pos\":","[],","\"rot\":","[]","} ","",""]
[null,null,null,null," ","{","","\"FPS\":","\"\",","\"pos\":","[],","\"rot\":","[]","} ","",""]
[null,null,null,null," ","{","","\"FPS\":","\"\",","\"pos\":","[],","\"rot\":","[]","} ","",""]
[null,null,null,null," ","{","","\"FPS\":","\"\",","\"pos\":","[],","\"rot\":","[]","} ","",""]
[null,null,null,null," ","{","","\"FPS\":","\"\",","\"pos\":","[],","\"rot\":","[]","} ","",""]
[null,null,null,null," ","{","","\"FPS\":","\"\",","\"pos\":","[],","\"rot\":","[]","} ","",""]
[null,null,null,null," ","{","","\"FPS\":","\"\",","\"pos\":","[],","\"rot\":","[]","} ","",""]
[null,null,null,null," ","{","","\"FPS\":","\"\",","\"pos\":","[],","\"rot\":","[]","} ","",""]
[null,null,null,null," ","{","","\"FPS\":","\"\",","\"pos\":","[],","\"rot\":","[]","} ","",""]
[null,null,null,null," ","{","","\"FPS\":","\"\",","\"pos\":","[],","\"rot\":","[]","} ","",""]
[null,null,null,null," ","{","","\"FPS\":","\"\",","\"pos\":","[],","\"rot\":","[]","} ","",""]
[null,null,null,null," ","{","","\"FPS\":","\"\",","\"pos\":","[],","\"rot\":","[]","} ","",""]
[null,null,null,null," ","{","","\"FPS\":","\"\",","\"pos\":","[],","\"rot\":","[]","} ","",""]
[null,null,null,null," ","{","","\"FPS\":","\"\",","\"pos\":","[],","\"rot\":","[]","} ","",""]
[null,null,null,null," ","{","","\"FPS\":","\"\",","\"pos\":","[],","\"rot\":","[]","} ","",""]
[null,null,null,null," ","{","","\"FPS\":","\"\",","\"pos\":","[],","\"rot\":","[]","} ","",""]
[null,null,null,null," ","{","","\"FPS\":","\"\",","\"pos\":","[],","\"rot\":","[]","} ","",""]
[null,null,null,null," ","{","","\"FPS\":","\"\",","\"pos\":","[],","\"rot\":","[]","} ","",""]
[null,null,null,null," ","{","","\"FPS\":","\"\",","\"pos\":","[],","\"rot\":","[]","} ","",""]
[null,null,null,null," ","{","","\"FPS\":","\"\",","\"pos\":","[],","\"rot\":","[]","} ","",""]
[null,null,null,null," ","{","","\"FPS\":","\"\",","\"pos\":","[],","\"rot\":","[]","} ","",""]
[null,null,null,null," ","{","","\"FPS\":","\"\",","\"pos\":","[],","\"rot\":","[]","} ","",""]
[null,null,null,null," ","{","","\"FPS\":","\"\",","\"pos\":","[],","\"rot\":","[]","} ","",""]
[null,null,null,null," ","{","","\"FPS\":","\"\",","\"pos\":","[],","\"rot\":","[]","} ","",""]
[null,null,null,null," ","{","","\"FPS\":","\"\",","\"pos\":","[],","\"rot\":","[]","} ","",""]
[null,null,null,null," ","{","","\"FPS\":","\"\",","\"pos\":","[],","\"rot\":","[]","} ","",""]
[null,null,null,null," ","{","","\"FPS\":","\"\",","\"pos\":","[],","\"rot\":","[]","} ","",""]
[null,null,null,null," ","{","","\"FPS\":","\"\",","\"pos\":","[],","\"rot\":","[]","} ","","",4]
[null,null,null,null," ","{","","\"FPS\":","\"\",","\"pos\":","[],","\"rot\":","[]","} ","",""]
[null,null,null,null," ","{","","\"FPS\":","\"\",","\"pos\":","[],","\"rot\":","[]","} ","",""]
[null,null,null,null," ","{","","\"FPS\":","\"\",","\"pos\":","[],","\"rot\":","[]","} ","",""]
[null,null,null,null," ","{","","\"FPS\":","\"\",","\"pos\":","[],","\"rot\":","[]","} ","",""]
[null,null,null,null," ","{","","\"FPS\":","\"\",","\"pos\":","[],","\"rot\":","[]","} ","",""]
[null,null,null,null," ","{","","\"FPS\":","\"\",","\"pos\":","[],","\"rot\":","[]","} ","",""]
[null,null,null,null," ","{","","\"FPS\":","\"\",","\"pos\":","[],","\"rot\":","[]","} ","",""]
[null,null,null,null," ","{","","\"FPS\":","\"\",","\"pos\":","[],","\"rot\":","[]","} ","",""]
[null,null,null,null," ","{","","\"FPS\":","\"\",","\"pos\":","[],","\"rot\":","[]","} ","",""]
[null,null,null,null," ","{","","\"FPS\":","\"\",","\"pos\":","[],","\"rot\":","[]","} ","",""]
[null,null,null,null," ","{","","\"FPS\":","\"\",","\"pos\":","[],","\"rot\":","[]","} ","",""]
[null,null,null,null," ","{","","\"FPS\":","\"\",","\"pos\":","[],","\"rot\":","[]","} ","",""]
[null,null,null,null," ","{","","\"FPS\":","\"\",","\"pos\":","[],","\"rot\":","[]","} ","",""]
[null,null,null,null," ","{","","\"FPS\":","\"\",","\"pos\":","[],","\"rot\":","[]","} ","",""]
[null,null,null,null," ","{","","\"FPS\":","\"\",","\"pos\":","[],","\"rot\":","[]","} ","",""]
[null,null,null,null," ","{","","\"FPS\":","\"\",","\"pos\":","[],","\"rot\":","[]","} ","",""]
[null,null,null,null," ","{","","\"FPS\":","\"\",","\"pos\":","[],","\"rot\":","[]","} ","",""]
[null,null,null,null," ","{","","\"FPS\":","\"\",","\"pos\":","[],","\"rot\":","[]","} ","",""]
[null,null,null,null," ","{","","\"FPS\":","\"\",","\"pos\":","[],","\"rot\":","[]","} ","",""]
[null,null,null,null," ","{","","\"FPS\":","\"\",","\"pos\":","[],","\"rot\":","[]","} ","",""]
[null,null,null,null," ","{","","\"FPS\":","\"\",","\"pos\":","[],","\"rot\":","[]","} ","",""]
[null,null,null,null," ","{","","\"FPS\":","\"\",","\"pos\":","[],","\"rot\":","[]","} ","",""]
[null,null,null,null," ","{","","\"FPS\":","\"\",","\"pos\":","[],","\"rot\":","[]","} ","",""]
[null,null,null,null," ","{","","\"FPS\":","\"\",","\"pos\":","[],","\"rot\":","[]","} ","",""]
[null,null,null,null," ","{","","\"FPS\":","\"\",","\"pos\":","[],","\"rot\":","[]","} ","",""]
[null,null,null,null," ","{","","\"FPS\":","\"\",","\"pos\":","[],","\"rot\":","[]","} ","",""]
[null,null,null,null," ","{","","\"FPS\":","\"\",","\"pos\":","[],","\"rot\":","[]","} ","",""]
[null,null,null,null," ","{","","\"FPS\":","\"\",","\"pos\":","[],","\"rot\":","[]","} ","",""]
[null,null,null,null," ","{",{"$f":"IF(A837<>\"\",CONCATENATE(\"\"\"\",A$3,\"\"\": \"\"\",A837,\"\"\", \"),\"\")","v":""},"\"FPS\":",{"$f":"CONCATENATE(\"\"\"\",B837,\"\"\"\",\",\")","v":"\"\","},"\"pos\":",{"$f":"CONCATENATE(\"[\",C837,\"]\",\",\")","v":"[],"},"\"rot\":",{"$f":"CONCATENATE(\"[\",D837,\"]\")","v":"[]"},"} ",{"$f":"IF(A837<>\"\",CONCATENATE(F837,G837,H837,I837,J837,K837,L837,M837,N837),\"\")","v":""},{"$f":"CONCATENATE(IF(AND(P836<>\"\",Q836=\"\"),CONCATENATE(P836,IF(A837<>\"\",\",\",\"\")),\"\"),O837)","v":""}]
[null,null,null,null," ","{","","\"FPS\":","\"\",","\"pos\":","[],","\"rot\":","[]","} ","",""]
[null,null,null,null," ","{","","\"FPS\":","\"\",","\"pos\":","[],","\"rot\":","[]","} ","",""]
[null,null,null,null," ","{","","\"FPS\":","\"\",","\"pos\":","[],","\"rot\":","[]","} ","",""]
[null,null,null,null," ","{","","\"FPS\":","\"\",","\"pos\":","[],","\"rot\":","[]","} ","",""]
[null,null,null,null," ","{","","\"FPS\":","\"\",","\"pos\":","[],","\"rot\":","[]","} ","",""]
[null,null,null,null," ","{","","\"FPS\":","\"\",","\"pos\":","[],","\"rot\":","[]","} ","",""]
[null,null,null,null," ","{","","\"FPS\":","\"\",","\"pos\":","[],","\"rot\":","[]","} ","",""]
[null,null,null,null," ","{","","\"FPS\":","\"\",","\"pos\":","[],","\"rot\":","[]","} ","",""]
[null,null,null,null," ","{","","\"FPS\":","\"\",","\"pos\":","[],","\"rot\":","[]","} ","",""]
[null,null,null,null," ","{","","\"FPS\":","\"\",","\"pos\":","[],","\"rot\":","[]","} ","",""]
[null,null,null,null," ","{","","\"FPS\":","\"\",","\"pos\":","[],","\"rot\":","[]","} ","",""]
[null,null,null,null," ","{","","\"FPS\":","\"\",","\"pos\":","[],","\"rot\":","[]","} ","",""]
[null,null,null,null," ","{","","\"FPS\":","\"\",","\"pos\":","[],","\"rot\":","[]","} ","",""]
[null,null,null,null," ","{","","\"FPS\":","\"\",","\"pos\":","[],","\"rot\":","[]","} ","",""]
[null,null,null,null," ","{","","\"FPS\":","\"\",","\"pos\":","[],","\"rot\":","[]","} ","",""]
[null,null,null,null," ","{","","\"FPS\":","\"\",","\"pos\":","[],","\"rot\":","[]","} ","",""]
[null,null,null,null," ","{","","\"FPS\":","\"\",","\"pos\":","[],","\"rot\":","[]","} ","",""]
[null,null,null,null," ","{","","\"FPS\":","\"\",","\"pos\":","[],","\"rot\":","[]","} ","",""]
[null,null,null,null," ","{","","\"FPS\":","\"\",","\"pos\":","[],","\"rot\":","[]","} ","",""]
[null,null,null,null," ","{","","\"FPS\":","\"\",","\"pos\":","[],","\"rot\":","[]","} ","",""]
[null,null,null,null," ","{","","\"FPS\":","\"\",","\"pos\":","[],","\"rot\":","[]","} ","",""]
[null,null,null,null," ","{","","\"FPS\":","\"\",","\"pos\":","[],","\"rot\":","[]","} ","",""]
[null,null,null,null," ","{","","\"FPS\":","\"\",","\"pos\":","[],","\"rot\":","[]","} ","",""]
[null,null,null,null," ","{","","\"FPS\":","\"\",","\"pos\":","[],","\"rot\":","[]","} ","",""]
[null,null,null,null," ","{","","\"FPS\":","\"\",","\"pos\":","[],","\"rot\":","[]","} ","",""]
[null,null,null,null," ","{","","\"FPS\":","\"\",","\"pos\":","[],","\"rot\":","[]","} ","",""]
[null,null,null,null," ","{","","\"FPS\":","\"\",","\"pos\":","[],","\"rot\":","[]","} ","",""]
[null,null,null,null," ","{","","\"FPS\":","\"\",","\"pos\":","[],","\"rot\":","[]","} ","",""]
[null,null,null,null," ","{","","\"FPS\":","\"\",","\"pos\":","[],","\"rot\":","[]","} ","",""]
[null,null,null,null," ","{","","\"FPS\":","\"\",","\"pos\":","[],","\"rot\":","[]","} ","",""]
[null,null,null,null," ","{","","\"FPS\":","\"\",","\"pos\":","[],","\"rot\":","[]","} ","",""]
[null,null,null,null," ","{","","\"FPS\":","\"\",","\"pos\":","[],","\"rot\":","[]","} ","",""]
[null,null,null,null," ","{","","\"FPS\":","\"\",","\"pos\":","[],","\"rot\":","[]","} ","",""]
[null,null,null,null," ","{","","\"FPS\":","\"\",","\"pos\":","[],","\"rot\":","[]","} ","",""]
[null,null,null,null," ","{","","\"FPS\":","\"\",","\"pos\":","[],","\"rot\":","[]","} ","",""]
[null,null,null,null," ","{","","\"FPS\":","\"\",","\"pos\":","[],","\"rot\":","[]","} ","",""]
[null,null,null,null," ","{","","\"FPS\":","\"\",","\"pos\":","[],","\"rot\":","[]","} ","",""]
[null,null,null,null," ","{","","\"FPS\":","\"\",","\"pos\":","[],","\"rot\":","[]","} ","",""]
[null,null,null,null," ","{","","\"FPS\":","\"\",","\"pos\":","[],","\"rot\":","[]","} ","",""]
[null,null,null,null," ","{","","\"FPS\":","\"\",","\"pos\":","[],","\"rot\":","[]","} ","",""]
[null,null,null,null," ","{","","\"FPS\":","\"\",","\"pos\":","[],","\"rot\":","[]","} ","",""]
[null,null,null,null," ","{","","\"FPS\":","\"\",","\"pos\":","[],","\"rot\":","[]","} ","",""]
[null,null,null,null," ","{","","\"FPS\":","\"\",","\"pos\":","[],","\"rot\":","[]","} ","",""]
[null,null,null,null," ","{","","\"FPS\":","\"\",","\"pos\":","[],","\"rot\":","[]","} ","",""]
[null,null,null,null," ","{","","\"FPS\":","\"\",","\"pos\":","[],","\"rot\":","[]","} ","",""]
[null,null,null,null," ","{","","\"FPS\":","\"\",","\"pos\":","[],","\"rot\":","[]","} ","",""]
[null,null,null,null," ","{","","\"FPS\":","\"\",","\"pos\":","[],","\"rot\":","[]","} ","",""]
[null,null,null,null," ","{","","\"FPS\":","\"\",","\"pos\":","[],","\"rot\":","[]","} ","",""]
[null,null,null,null," ","{","","\"FPS\":","\"\",","\"pos\":","[],","\"rot\":","[]","} ","",""]
[null,null,null,null," ","{","","\"FPS\":","\"\",","\"pos\":","[],","\"rot\":","[]","} ","",""]
[null,null,null,null," ","{","","\"FPS\":","\"\",","\"pos\":","[],","\"rot\":","[]","} ","",""]
[null,null,null,null," ","{","","\"FPS\":","\"\",","\"pos\":","[],","\"rot\":","[]","} ","",""]
[null,null,null,null," ","{","","\"FPS\":","\"\",","\"pos\":","[],","\"rot\":","[]","} ","",""]
[null,null,null,null," ","{","","\"FPS\":","\"\",","\"pos\":","[],","\"rot\":","[]","} ","",""]
[null,null,null,null," ","{","","\"FPS\":","\"\",","\"pos\":","[],","\"rot\":","[]","} ","",""]
[null,null,null,null," ","{","","\"FPS\":","\"\",","\"pos\":","[],","\"rot\":","[]","} ","",""]
[null,null,null,null," ","{","","\"FPS\":","\"\",","\"pos\":","[],","\"rot\":","[]","} ","",""]
[null,null,null,null," ","{","","\"FPS\":","\"\",","\"pos\":","[],","\"rot\":","[]","} ","",""]
[null,null,null,null," ","{","","\"FPS\":","\"\",","\"pos\":","[],","\"rot\":","[]","} ","",""]
[null,null,null,null," ","{","","\"FPS\":","\"\",","\"pos\":","[],","\"rot\":","[]","} ","",""]
[null,null,null,null," ","{","","\"FPS\":","\"\",","\"pos\":","[],","\"rot\":","[]","} ","",""]
[null,null,null,null," ","{","","\"FPS\":","\"\",","\"pos\":","[],","\"rot\":","[]","} ","",""]
[null,null,null,null," ","{","","\"FPS\":","\"\",","\"pos\":","[],","\"rot\":","[]","} ","",""]
[null,null,null,null," ","{",{"$f":"IF(A901<>\"\",CONCATENATE(\"\"\"\",A$3,\"\"\": \"\"\",A901,\"\"\", \"),\"\")","v":""},"\"FPS\":",{"$f":"CONCATENATE(\"\"\"\",B901,\"\"\"\",\",\")","v":"\"\","},"\"pos\":",{"$f":"CONCATENATE(\"[\",C901,\"]\",\",\")","v":"[],"},"\"rot\":",{"$f":"CONCATENATE(\"[\",D901,\"]\")","v":"[]"},"} ",{"$f":"IF(A901<>\"\",CONCATENATE(F901,G901,H901,I901,J901,K901,L901,M901,N901),\"\")","v":""},{"$f":"CONCATENATE(IF(AND(P900<>\"\",Q900=\"\"),CONCATENATE(P900,IF(A901<>\"\",\",\",\"\")),\"\"),O901)","v":""}]
[null,null,null,null," ","{","","\"FPS\":","\"\",","\"pos\":","[],","\"rot\":","[]","} ","",""]
[null,null,null,null," ","{","","\"FPS\":","\"\",","\"pos\":","[],","\"rot\":","[]","} ","",""]
[null,null,null,null," ","{","","\"FPS\":","\"\",","\"pos\":","[],","\"rot\":","[]","} ","",""]
[null,null,null,null," ","{","","\"FPS\":","\"\",","\"pos\":","[],","\"rot\":","[]","} ","",""]
[null,null,null,null," ","{","","\"FPS\":","\"\",","\"pos\":","[],","\"rot\":","[]","} ","",""]
[null,null,null,null," ","{","","\"FPS\":","\"\",","\"pos\":","[],","\"rot\":","[]","} ","",""]
[null,null,null,null," ","{","","\"FPS\":","\"\",","\"pos\":","[],","\"rot\":","[]","} ","",""]
[null,null,null,null," ","{","","\"FPS\":","\"\",","\"pos\":","[],","\"rot\":","[]","} ","",""]
[null,null,null,null," ","{","","\"FPS\":","\"\",","\"pos\":","[],","\"rot\":","[]","} ","",""]
[null,null,null,null," ","{","","\"FPS\":","\"\",","\"pos\":","[],","\"rot\":","[]","} ","",""]
[null,null,null,null," ","{","","\"FPS\":","\"\",","\"pos\":","[],","\"rot\":","[]","} ","",""]
[null,null,null,null," ","{","","\"FPS\":","\"\",","\"pos\":","[],","\"rot\":","[]","} ","",""]
[null,null,null,null," ","{","","\"FPS\":","\"\",","\"pos\":","[],","\"rot\":","[]","} ","",""]
[null,null,null,null," ","{","","\"FPS\":","\"\",","\"pos\":","[],","\"rot\":","[]","} ","",""]
[null,null,null,null," ","{","","\"FPS\":","\"\",","\"pos\":","[],","\"rot\":","[]","} ","",""]
[null,null,null,null," ","{","","\"FPS\":","\"\",","\"pos\":","[],","\"rot\":","[]","} ","",""]
[null,null,null,null," ","{","","\"FPS\":","\"\",","\"pos\":","[],","\"rot\":","[]","} ","",""]
[null,null,null,null," ","{","","\"FPS\":","\"\",","\"pos\":","[],","\"rot\":","[]","} ","",""]
[null,null,null,null," ","{","","\"FPS\":","\"\",","\"pos\":","[],","\"rot\":","[]","} ","",""]
[null,null,null,null," ","{","","\"FPS\":","\"\",","\"pos\":","[],","\"rot\":","[]","} ","",""]
[null,null,null,null," ","{","","\"FPS\":","\"\",","\"pos\":","[],","\"rot\":","[]","} ","",""]
[null,null,null,null," ","{","","\"FPS\":","\"\",","\"pos\":","[],","\"rot\":","[]","} ","",""]
[null,null,null,null," ","{","","\"FPS\":","\"\",","\"pos\":","[],","\"rot\":","[]","} ","",""]
[null,null,null,null," ","{","","\"FPS\":","\"\",","\"pos\":","[],","\"rot\":","[]","} ","",""]
[null,null,null,null," ","{","","\"FPS\":","\"\",","\"pos\":","[],","\"rot\":","[]","} ","",""]
[null,null,null,null," ","{","","\"FPS\":","\"\",","\"pos\":","[],","\"rot\":","[]","} ","",""]
[null,null,null,null," ","{","","\"FPS\":","\"\",","\"pos\":","[],","\"rot\":","[]","} ","",""]
[null,null,null,null," ","{","","\"FPS\":","\"\",","\"pos\":","[],","\"rot\":","[]","} ","",""]
[null,null,null,null," ","{","","\"FPS\":","\"\",","\"pos\":","[],","\"rot\":","[]","} ","",""]
[null,null,null,null," ","{","","\"FPS\":","\"\",","\"pos\":","[],","\"rot\":","[]","} ","",""]
[null,null,null,null," ","{","","\"FPS\":","\"\",","\"pos\":","[],","\"rot\":","[]","} ","",""]
[null,null,null,null," ","{","","\"FPS\":","\"\",","\"pos\":","[],","\"rot\":","[]","} ","",""]
[null,null,null,null," ","{","","\"FPS\":","\"\",","\"pos\":","[],","\"rot\":","[]","} ","",""]
[null,null,null,null," ","{","","\"FPS\":","\"\",","\"pos\":","[],","\"rot\":","[]","} ","",""]
[null,null,null,null," ","{","","\"FPS\":","\"\",","\"pos\":","[],","\"rot\":","[]","} ","",""]
[null,null,null,null," ","{","","\"FPS\":","\"\",","\"pos\":","[],","\"rot\":","[]","} ","",""]
[null,null,null,null," ","{","","\"FPS\":","\"\",","\"pos\":","[],","\"rot\":","[]","} ","",""]
[null,null,null,null," ","{","","\"FPS\":","\"\",","\"pos\":","[],","\"rot\":","[]","} ","",""]
[null,null,null,null," ","{","","\"FPS\":","\"\",","\"pos\":","[],","\"rot\":","[]","} ","",""]
[null,null,null,null," ","{","","\"FPS\":","\"\",","\"pos\":","[],","\"rot\":","[]","} ","",""]
[null,null,null,null," ","{","","\"FPS\":","\"\",","\"pos\":","[],","\"rot\":","[]","} ","",""]
[null,null,null,null," ","{","","\"FPS\":","\"\",","\"pos\":","[],","\"rot\":","[]","} ","",""]
[null,null,null,null," ","{","","\"FPS\":","\"\",","\"pos\":","[],","\"rot\":","[]","} ","",""]
[null,null,null,null," ","{","","\"FPS\":","\"\",","\"pos\":","[],","\"rot\":","[]","} ","",""]
[null,null,null,null," ","{","","\"FPS\":","\"\",","\"pos\":","[],","\"rot\":","[]","} ","",""]
[null,null,null,null," ","{","","\"FPS\":","\"\",","\"pos\":","[],","\"rot\":","[]","} ","",""]
[null,null,null,null," ","{","","\"FPS\":","\"\",","\"pos\":","[],","\"rot\":","[]","} ","",""]
[null,null,null,null," ","{","","\"FPS\":","\"\",","\"pos\":","[],","\"rot\":","[]","} ","",""]
[null,null,null,null," ","{","","\"FPS\":","\"\",","\"pos\":","[],","\"rot\":","[]","} ","",""]
[null,null,null,null," ","{","","\"FPS\":","\"\",","\"pos\":","[],","\"rot\":","[]","} ","",""]
[null,null,null,null," ","{","","\"FPS\":","\"\",","\"pos\":","[],","\"rot\":","[]","} ","",""]
[null,null,null,null," ","{","","\"FPS\":","\"\",","\"pos\":","[],","\"rot\":","[]","} ","",""]
[null,null,null,null," ","{","","\"FPS\":","\"\",","\"pos\":","[],","\"rot\":","[]","} ","",""]
[null,null,null,null," ","{","","\"FPS\":","\"\",","\"pos\":","[],","\"rot\":","[]","} ","",""]
[null,null,null,null," ","{","","\"FPS\":","\"\",","\"pos\":","[],","\"rot\":","[]","} ","",""]
[null,null,null,null," ","{","","\"FPS\":","\"\",","\"pos\":","[],","\"rot\":","[]","} ","",""]
[null,null,null,null," ","{","","\"FPS\":","\"\",","\"pos\":","[],","\"rot\":","[]","} ","",""]
[null,null,null,null," ","{","","\"FPS\":","\"\",","\"pos\":","[],","\"rot\":","[]","} ","",""]
[null,null,null,null," ","{","","\"FPS\":","\"\",","\"pos\":","[],","\"rot\":","[]","} ","",""]
[null,null,null,null," ","{","","\"FPS\":","\"\",","\"pos\":","[],","\"rot\":","[]","} ","",""]
[null,null,null,null," ","{","","\"FPS\":","\"\",","\"pos\":","[],","\"rot\":","[]","} ","",""]
[null,null,null,null," ","{","","\"FPS\":","\"\",","\"pos\":","[],","\"rot\":","[]","} ","",""]
[null,null,null,null," ","{","","\"FPS\":","\"\",","\"pos\":","[],","\"rot\":","[]","} ","",""]
[null,null,null,null," ","{",{"$f":"IF(A965<>\"\",CONCATENATE(\"\"\"\",A$3,\"\"\": \"\"\",A965,\"\"\", \"),\"\")","v":""},"\"FPS\":",{"$f":"CONCATENATE(\"\"\"\",B965,\"\"\"\",\",\")","v":"\"\","},"\"pos\":",{"$f":"CONCATENATE(\"[\",C965,\"]\",\",\")","v":"[],"},"\"rot\":",{"$f":"CONCATENATE(\"[\",D965,\"]\")","v":"[]"},"} ",{"$f":"IF(A965<>\"\",CONCATENATE(F965,G965,H965,I965,J965,K965,L965,M965,N965),\"\")","v":""},{"$f":"CONCATENATE(IF(AND(P964<>\"\",Q964=\"\"),CONCATENATE(P964,IF(A965<>\"\",\",\",\"\")),\"\"),O965)","v":""}]
[null,null,null,null," ","{","","\"FPS\":","\"\",","\"pos\":","[],","\"rot\":","[]","} ","",""]
[null,null,null,null," ","{","","\"FPS\":","\"\",","\"pos\":","[],","\"rot\":","[]","} ","",""]
[null,null,null,null," ","{","","\"FPS\":","\"\",","\"pos\":","[],","\"rot\":","[]","} ","",""]
[null,null,null,null," ","{","","\"FPS\":","\"\",","\"pos\":","[],","\"rot\":","[]","} ","",""]
[null,null,null,null," ","{","","\"FPS\":","\"\",","\"pos\":","[],","\"rot\":","[]","} ","",""]
[null,null,null,null," ","{","","\"FPS\":","\"\",","\"pos\":","[],","\"rot\":","[]","} ","",""]
[null,null,null,null," ","{","","\"FPS\":","\"\",","\"pos\":","[],","\"rot\":","[]","} ","",""]
[null,null,null,null," ","{","","\"FPS\":","\"\",","\"pos\":","[],","\"rot\":","[]","} ","",""]
[null,null,null,null," ","{","","\"FPS\":","\"\",","\"pos\":","[],","\"rot\":","[]","} ","",""]
[null,null,null,null," ","{","","\"FPS\":","\"\",","\"pos\":","[],","\"rot\":","[]","} ","",""]
[null,null,null,null," ","{","","\"FPS\":","\"\",","\"pos\":","[],","\"rot\":","[]","} ","",""]
[null,null,null,null," ","{","","\"FPS\":","\"\",","\"pos\":","[],","\"rot\":","[]","} ","",""]
[null,null,null,null," ","{","","\"FPS\":","\"\",","\"pos\":","[],","\"rot\":","[]","} ","",""]
[null,null,null,null," ","{","","\"FPS\":","\"\",","\"pos\":","[],","\"rot\":","[]","} ","",""]
[null,null,null,null," ","{","","\"FPS\":","\"\",","\"pos\":","[],","\"rot\":","[]","} ","",""]
[null,null,null,null," ","{","","\"FPS\":","\"\",","\"pos\":","[],","\"rot\":","[]","} ","",""]
[null,null,null,null," ","{","","\"FPS\":","\"\",","\"pos\":","[],","\"rot\":","[]","} ","",""]
[null,null,null,null," ","{","","\"FPS\":","\"\",","\"pos\":","[],","\"rot\":","[]","} ","",""]
[null,null,null,null," ","{","","\"FPS\":","\"\",","\"pos\":","[],","\"rot\":","[]","} ","",""]
[null,null,null,null," ","{","","\"FPS\":","\"\",","\"pos\":","[],","\"rot\":","[]","} ","",""]
[null,null,null,null," ","{","","\"FPS\":","\"\",","\"pos\":","[],","\"rot\":","[]","} ","",""]
[null,null,null,null," ","{","","\"FPS\":","\"\",","\"pos\":","[],","\"rot\":","[]","} ","",""]
[null,null,null,null," ","{","","\"FPS\":","\"\",","\"pos\":","[],","\"rot\":","[]","} ","",""]
[null,null,null,null," ","{","","\"FPS\":","\"\",","\"pos\":","[],","\"rot\":","[]","} ","",""]
[null,null,null,null," ","{","","\"FPS\":","\"\",","\"pos\":","[],","\"rot\":","[]","} ","",""]
[null,null,null,null," ","{","","\"FPS\":","\"\",","\"pos\":","[],","\"rot\":","[]","} ","",""]
[null,null,null,null," ","{","","\"FPS\":","\"\",","\"pos\":","[],","\"rot\":","[]","} ","",""]
[null,null,null,null," ","{","","\"FPS\":","\"\",","\"pos\":","[],","\"rot\":","[]","} ","",""]
[null,null,null,null," ","{","","\"FPS\":","\"\",","\"pos\":","[],","\"rot\":","[]","} ","",""]
[null,null,null,null," ","{","","\"FPS\":","\"\",","\"pos\":","[],","\"rot\":","[]","} ","",""]
[null,null,null,null," ","{","","\"FPS\":","\"\",","\"pos\":","[],","\"rot\":","[]","} ","",""]
[null,null,null,null," ","{","","\"FPS\":","\"\",","\"pos\":","[],","\"rot\":","[]","} ","",""]
[null,null,null,null," ","{","","\"FPS\":","\"\",","\"pos\":","[],","\"rot\":","[]","} ","",""]
[null,null,null,null," ","{","","\"FPS\":","\"\",","\"pos\":","[],","\"rot\":","[]","} ","",""]
[null,null,null,null," ","{","","\"FPS\":","\"\",","\"pos\":","[],","\"rot\":","[]","} ","",""]
[null,null,null,null," ","{","","\"FPS\":","\"\",","\"pos\":","[],","\"rot\":","[]","} ","",""]
[null,null,null,null," ","{","","\"FPS\":","\"\",","\"pos\":","[],","\"rot\":","[]","} ","",""]
[null,null,null,null," ","{","","\"FPS\":","\"\",","\"pos\":","[],","\"rot\":","[]","} ","",""]
[null,null,null,null," ","{","","\"FPS\":","\"\",","\"pos\":","[],","\"rot\":","[]","} ","",""]
[null,null,null,null," ","{","","\"FPS\":","\"\",","\"pos\":","[],","\"rot\":","[]","} ","",""]
[null,null,null,null," ","{","","\"FPS\":","\"\",","\"pos\":","[],","\"rot\":","[]","} ","",""]
[null,null,null,null," ","{","","\"FPS\":","\"\",","\"pos\":","[],","\"rot\":","[]","} ","",""]
[null,null,null,null," ","{","","\"FPS\":","\"\",","\"pos\":","[],","\"rot\":","[]","} ","",""]
[null,null,null,null," ","{","","\"FPS\":","\"\",","\"pos\":","[],","\"rot\":","[]","} ","",""]
[null,null,null,null," ","{","","\"FPS\":","\"\",","\"pos\":","[],","\"rot\":","[]","} ","",""]
[null,null,null,null," ","{","","\"FPS\":","\"\",","\"pos\":","[],","\"rot\":","[]","} ","",""]
[null,null,null,null," ","{","","\"FPS\":","\"\",","\"pos\":","[],","\"rot\":","[]","} ","",""]
[null,null,null,null," ","{","","\"FPS\":","\"\",","\"pos\":","[],","\"rot\":","[]","} ","",""]
[null,null,null,null," ","{","","\"FPS\":","\"\",","\"pos\":","[],","\"rot\":","[]","} ","",""]
[null,null,null,null," ","{","","\"FPS\":","\"\",","\"pos\":","[],","\"rot\":","[]","} ","",""]
[null,null,null,null," ","{","","\"FPS\":","\"\",","\"pos\":","[],","\"rot\":","[]","} ","",""]
[null,null,null,null," ","{","","\"FPS\":","\"\",","\"pos\":","[],","\"rot\":","[]","} ","",""]
[null,null,null,null," ","{","","\"FPS\":","\"\",","\"pos\":","[],","\"rot\":","[]","} ","",""]
[null,null,null,null," ","{","","\"FPS\":","\"\",","\"pos\":","[],","\"rot\":","[]","} ","",""]
[null,null,null,null," ","{","","\"FPS\":","\"\",","\"pos\":","[],","\"rot\":","[]","} ","",""]
[null,null,null,null," ","{","","\"FPS\":","\"\",","\"pos\":","[],","\"rot\":","[]","} ","",""]
[null,null,null,null," ","{","","\"FPS\":","\"\",","\"pos\":","[],","\"rot\":","[]","} ","",""]
[null,null,null,null," ","{","","\"FPS\":","\"\",","\"pos\":","[],","\"rot\":","[]","} ","",""]
[null,null,null,null," ","{","","\"FPS\":","\"\",","\"pos\":","[],","\"rot\":","[]","} ","",""]
[null,null,null,null," ","{","","\"FPS\":","\"\",","\"pos\":","[],","\"rot\":","[]","} ","",""]
[null,null,null,null," ","{","","\"FPS\":","\"\",","\"pos\":","[],","\"rot\":","[]","} ","",""]
[null,null,null,null," ","{","","\"FPS\":","\"\",","\"pos\":","[],","\"rot\":","[]","} ","",""]
[null,null,null,null," ","{","","\"FPS\":","\"\",","\"pos\":","[],","\"rot\":","[]","} ","","",5]
[null,null,null,null," ","{",{"$f":"IF(A1029<>\"\",CONCATENATE(\"\"\"\",A$3,\"\"\": \"\"\",A1029,\"\"\", \"),\"\")","v":""},"\"FPS\":",{"$f":"CONCATENATE(\"\"\"\",B1029,\"\"\"\",\",\")","v":"\"\","},"\"pos\":",{"$f":"CONCATENATE(\"[\",C1029,\"]\",\",\")","v":"[],"},"\"rot\":",{"$f":"CONCATENATE(\"[\",D1029,\"]\")","v":"[]"},"} ",{"$f":"IF(A1029<>\"\",CONCATENATE(F1029,G1029,H1029,I1029,J1029,K1029,L1029,M1029,N1029),\"\")","v":""},{"$f":"CONCATENATE(IF(AND(P1028<>\"\",Q1028=\"\"),CONCATENATE(P1028,IF(A1029<>\"\",\",\",\"\")),\"\"),O1029)","v":""}]
[null,null,null,null," ","{","","\"FPS\":","\"\",","\"pos\":","[],","\"rot\":","[]","} ","",""]
[null,null,null,null," ","{","","\"FPS\":","\"\",","\"pos\":","[],","\"rot\":","[]","} ","",""]
[null,null,null,null," ","{","","\"FPS\":","\"\",","\"pos\":","[],","\"rot\":","[]","} ","",""]
[null,null,null,null," ","{","","\"FPS\":","\"\",","\"pos\":","[],","\"rot\":","[]","} ","",""]
[null,null,null,null," ","{","","\"FPS\":","\"\",","\"pos\":","[],","\"rot\":","[]","} ","",""]
[null,null,null,null," ","{","","\"FPS\":","\"\",","\"pos\":","[],","\"rot\":","[]","} ","",""]
[null,null,null,null," ","{","","\"FPS\":","\"\",","\"pos\":","[],","\"rot\":","[]","} ","",""]
[null,null,null,null," ","{","","\"FPS\":","\"\",","\"pos\":","[],","\"rot\":","[]","} ","",""]
[null,null,null,null," ","{","","\"FPS\":","\"\",","\"pos\":","[],","\"rot\":","[]","} ","",""]
[null,null,null,null," ","{","","\"FPS\":","\"\",","\"pos\":","[],","\"rot\":","[]","} ","",""]
[null,null,null,null," ","{","","\"FPS\":","\"\",","\"pos\":","[],","\"rot\":","[]","} ","",""]
[null,null,null,null," ","{","","\"FPS\":","\"\",","\"pos\":","[],","\"rot\":","[]","} ","",""]
[null,null,null,null," ","{","","\"FPS\":","\"\",","\"pos\":","[],","\"rot\":","[]","} ","",""]
[null,null,null,null," ","{","","\"FPS\":","\"\",","\"pos\":","[],","\"rot\":","[]","} ","",""]
[null,null,null,null," ","{","","\"FPS\":","\"\",","\"pos\":","[],","\"rot\":","[]","} ","",""]
[null,null,null,null," ","{","","\"FPS\":","\"\",","\"pos\":","[],","\"rot\":","[]","} ","",""]
[null,null,null,null," ","{","","\"FPS\":","\"\",","\"pos\":","[],","\"rot\":","[]","} ","",""]
[null,null,null,null," ","{","","\"FPS\":","\"\",","\"pos\":","[],","\"rot\":","[]","} ","",""]
[null,null,null,null," ","{","","\"FPS\":","\"\",","\"pos\":","[],","\"rot\":","[]","} ","",""]
[null,null,null,null," ","{","","\"FPS\":","\"\",","\"pos\":","[],","\"rot\":","[]","} ","",""]
[null,null,null,null," ","{","","\"FPS\":","\"\",","\"pos\":","[],","\"rot\":","[]","} ","",""]
[null,null,null,null," ","{","","\"FPS\":","\"\",","\"pos\":","[],","\"rot\":","[]","} ","",""]
[null,null,null,null," ","{","","\"FPS\":","\"\",","\"pos\":","[],","\"rot\":","[]","} ","",""]
[null,null,null,null," ","{","","\"FPS\":","\"\",","\"pos\":","[],","\"rot\":","[]","} ","",""]
[null,null,null,null," ","{","","\"FPS\":","\"\",","\"pos\":","[],","\"rot\":","[]","} ","",""]
[null,null,null,null," ","{","","\"FPS\":","\"\",","\"pos\":","[],","\"rot\":","[]","} ","",""]
[null,null,null,null," ","{","","\"FPS\":","\"\",","\"pos\":","[],","\"rot\":","[]","} ","",""]
[null,null,null,null," ","{","","\"FPS\":","\"\",","\"pos\":","[],","\"rot\":","[]","} ","",""]
[null,null,null,null," ","{","","\"FPS\":","\"\",","\"pos\":","[],","\"rot\":","[]","} ","",""]
[null,null,null,null," ","{","","\"FPS\":","\"\",","\"pos\":","[],","\"rot\":","[]","} ","",""]
[null,null,null,null," ","{","","\"FPS\":","\"\",","\"pos\":","[],","\"rot\":","[]","} ","",""]
[null,null,null,null," ","{","","\"FPS\":","\"\",","\"pos\":","[],","\"rot\":","[]","} ","",""]
[null,null,null,null," ","{","","\"FPS\":","\"\",","\"pos\":","[],","\"rot\":","[]","} ","",""]
[null,null,null,null," ","{","","\"FPS\":","\"\",","\"pos\":","[],","\"rot\":","[]","} ","",""]
[null,null,null,null," ","{","","\"FPS\":","\"\",","\"pos\":","[],","\"rot\":","[]","} ","",""]
[null,null,null,null," ","{","","\"FPS\":","\"\",","\"pos\":","[],","\"rot\":","[]","} ","",""]
[null,null,null,null," ","{","","\"FPS\":","\"\",","\"pos\":","[],","\"rot\":","[]","} ","",""]
[null,null,null,null," ","{","","\"FPS\":","\"\",","\"pos\":","[],","\"rot\":","[]","} ","",""]
[null,null,null,null," ","{","","\"FPS\":","\"\",","\"pos\":","[],","\"rot\":","[]","} ","",""]
[null,null,null,null," ","{","","\"FPS\":","\"\",","\"pos\":","[],","\"rot\":","[]","} ","",""]
[null,null,null,null," ","{","","\"FPS\":","\"\",","\"pos\":","[],","\"rot\":","[]","} ","",""]
[null,null,null,null," ","{","","\"FPS\":","\"\",","\"pos\":","[],","\"rot\":","[]","} ","",""]
[null,null,null,null," ","{","","\"FPS\":","\"\",","\"pos\":","[],","\"rot\":","[]","} ","",""]
[null,null,null,null," ","{","","\"FPS\":","\"\",","\"pos\":","[],","\"rot\":","[]","} ","",""]
[null,null,null,null," ","{","","\"FPS\":","\"\",","\"pos\":","[],","\"rot\":","[]","} ","",""]
[null,null,null,null," ","{","","\"FPS\":","\"\",","\"pos\":","[],","\"rot\":","[]","} ","",""]
[null,null,null,null," ","{","","\"FPS\":","\"\",","\"pos\":","[],","\"rot\":","[]","} ","",""]
[null,null,null,null," ","{","","\"FPS\":","\"\",","\"pos\":","[],","\"rot\":","[]","} ","",""]
[null,null,null,null," ","{","","\"FPS\":","\"\",","\"pos\":","[],","\"rot\":","[]","} ","",""]
[null,null,null,null," ","{","","\"FPS\":","\"\",","\"pos\":","[],","\"rot\":","[]","} ","",""]
[null,null,null,null," ","{","","\"FPS\":","\"\",","\"pos\":","[],","\"rot\":","[]","} ","",""]
[null,null,null,null," ","{","","\"FPS\":","\"\",","\"pos\":","[],","\"rot\":","[]","} ","",""]
[null,null,null,null," ","{","","\"FPS\":","\"\",","\"pos\":","[],","\"rot\":","[]","} ","",""]
[null,null,null,null," ","{","","\"FPS\":","\"\",","\"pos\":","[],","\"rot\":","[]","} ","",""]
[null,null,null,null," ","{","","\"FPS\":","\"\",","\"pos\":","[],","\"rot\":","[]","} ","",""]
[null,null,null,null," ","{","","\"FPS\":","\"\",","\"pos\":","[],","\"rot\":","[]","} ","",""]
[null,null,null,null," ","{","","\"FPS\":","\"\",","\"pos\":","[],","\"rot\":","[]","} ","",""]
[null,null,null,null," ","{","","\"FPS\":","\"\",","\"pos\":","[],","\"rot\":","[]","} ","",""]
[null,null,null,null," ","{","","\"FPS\":","\"\",","\"pos\":","[],","\"rot\":","[]","} ","",""]
[null,null,null,null," ","{","","\"FPS\":","\"\",","\"pos\":","[],","\"rot\":","[]","} ","",""]
[null,null,null,null," ","{","","\"FPS\":","\"\",","\"pos\":","[],","\"rot\":","[]","} ","",""]
[null,null,null,null," ","{","","\"FPS\":","\"\",","\"pos\":","[],","\"rot\":","[]","} ","",""]
[null,null,null,null," ","{","","\"FPS\":","\"\",","\"pos\":","[],","\"rot\":","[]","} ","",""]
[null,null,null,null," ","{",{"$f":"IF(A1093<>\"\",CONCATENATE(\"\"\"\",A$3,\"\"\": \"\"\",A1093,\"\"\", \"),\"\")","v":""},"\"FPS\":",{"$f":"CONCATENATE(\"\"\"\",B1093,\"\"\"\",\",\")","v":"\"\","},"\"pos\":",{"$f":"CONCATENATE(\"[\",C1093,\"]\",\",\")","v":"[],"},"\"rot\":",{"$f":"CONCATENATE(\"[\",D1093,\"]\")","v":"[]"},"} ",{"$f":"IF(A1093<>\"\",CONCATENATE(F1093,G1093,H1093,I1093,J1093,K1093,L1093,M1093,N1093),\"\")","v":""},{"$f":"CONCATENATE(IF(AND(P1092<>\"\",Q1092=\"\"),CONCATENATE(P1092,IF(A1093<>\"\",\",\",\"\")),\"\"),O1093)","v":""}]
[null,null,null,null," ","{","","\"FPS\":","\"\",","\"pos\":","[],","\"rot\":","[]","} ","",""]
[null,null,null,null," ","{","","\"FPS\":","\"\",","\"pos\":","[],","\"rot\":","[]","} ","",""]
[null,null,null,null," ","{","","\"FPS\":","\"\",","\"pos\":","[],","\"rot\":","[]","} ","",""]
[null,null,null,null," ","{","","\"FPS\":","\"\",","\"pos\":","[],","\"rot\":","[]","} ","",""]
[null,null,null,null," ","{","","\"FPS\":","\"\",","\"pos\":","[],","\"rot\":","[]","} ","",""]
[null,null,null,null," ","{","","\"FPS\":","\"\",","\"pos\":","[],","\"rot\":","[]","} ","",""]
[null,null,null,null," ","{","","\"FPS\":","\"\",","\"pos\":","[],","\"rot\":","[]","} ","",""]
[null,null,null,null," ","{","","\"FPS\":","\"\",","\"pos\":","[],","\"rot\":","[]","} ","",""]
[null,null,null,null," ","{","","\"FPS\":","\"\",","\"pos\":","[],","\"rot\":","[]","} ","",""]
[null,null,null,null," ","{","","\"FPS\":","\"\",","\"pos\":","[],","\"rot\":","[]","} ","",""]
[null,null,null,null," ","{","","\"FPS\":","\"\",","\"pos\":","[],","\"rot\":","[]","} ","",""]
[null,null,null,null," ","{","","\"FPS\":","\"\",","\"pos\":","[],","\"rot\":","[]","} ","",""]
[null,null,null,null," ","{","","\"FPS\":","\"\",","\"pos\":","[],","\"rot\":","[]","} ","",""]
[null,null,null,null," ","{","","\"FPS\":","\"\",","\"pos\":","[],","\"rot\":","[]","} ","",""]
[null,null,null,null," ","{","","\"FPS\":","\"\",","\"pos\":","[],","\"rot\":","[]","} ","",""]
[null,null,null,null," ","{","","\"FPS\":","\"\",","\"pos\":","[],","\"rot\":","[]","} ","",""]
[null,null,null,null," ","{","","\"FPS\":","\"\",","\"pos\":","[],","\"rot\":","[]","} ","",""]
[null,null,null,null," ","{","","\"FPS\":","\"\",","\"pos\":","[],","\"rot\":","[]","} ","",""]
[null,null,null,null," ","{","","\"FPS\":","\"\",","\"pos\":","[],","\"rot\":","[]","} ","",""]
[null,null,null,null," ","{","","\"FPS\":","\"\",","\"pos\":","[],","\"rot\":","[]","} ","",""]
[null,null,null,null," ","{","","\"FPS\":","\"\",","\"pos\":","[],","\"rot\":","[]","} ","",""]
[null,null,null,null," ","{","","\"FPS\":","\"\",","\"pos\":","[],","\"rot\":","[]","} ","",""]
[null,null,null,null," ","{","","\"FPS\":","\"\",","\"pos\":","[],","\"rot\":","[]","} ","",""]
[null,null,null,null," ","{","","\"FPS\":","\"\",","\"pos\":","[],","\"rot\":","[]","} ","",""]
[null,null,null,null," ","{","","\"FPS\":","\"\",","\"pos\":","[],","\"rot\":","[]","} ","",""]
[null,null,null,null," ","{","","\"FPS\":","\"\",","\"pos\":","[],","\"rot\":","[]","} ","",""]
[null,null,null,null," ","{","","\"FPS\":","\"\",","\"pos\":","[],","\"rot\":","[]","} ","",""]
[null,null,null,null," ","{","","\"FPS\":","\"\",","\"pos\":","[],","\"rot\":","[]","} ","",""]
[null,null,null,null," ","{","","\"FPS\":","\"\",","\"pos\":","[],","\"rot\":","[]","} ","",""]
[null,null,null,null," ","{","","\"FPS\":","\"\",","\"pos\":","[],","\"rot\":","[]","} ","",""]
[null,null,null,null," ","{","","\"FPS\":","\"\",","\"pos\":","[],","\"rot\":","[]","} ","",""]
[null,null,null,null," ","{","","\"FPS\":","\"\",","\"pos\":","[],","\"rot\":","[]","} ","",""]
[null,null,null,null," ","{","","\"FPS\":","\"\",","\"pos\":","[],","\"rot\":","[]","} ","",""]
[null,null,null,null," ","{","","\"FPS\":","\"\",","\"pos\":","[],","\"rot\":","[]","} ","",""]
[null,null,null,null," ","{","","\"FPS\":","\"\",","\"pos\":","[],","\"rot\":","[]","} ","",""]
[null,null,null,null," ","{","","\"FPS\":","\"\",","\"pos\":","[],","\"rot\":","[]","} ","",""]
[null,null,null,null," ","{","","\"FPS\":","\"\",","\"pos\":","[],","\"rot\":","[]","} ","",""]
[null,null,null,null," ","{","","\"FPS\":","\"\",","\"pos\":","[],","\"rot\":","[]","} ","",""]
[null,null,null,null," ","{","","\"FPS\":","\"\",","\"pos\":","[],","\"rot\":","[]","} ","",""]
[null,null,null,null," ","{","","\"FPS\":","\"\",","\"pos\":","[],","\"rot\":","[]","} ","",""]
[null,null,null,null," ","{","","\"FPS\":","\"\",","\"pos\":","[],","\"rot\":","[]","} ","",""]
[null,null,null,null," ","{","","\"FPS\":","\"\",","\"pos\":","[],","\"rot\":","[]","} ","",""]
[null,null,null,null," ","{","","\"FPS\":","\"\",","\"pos\":","[],","\"rot\":","[]","} ","",""]
[null,null,null,null," ","{","","\"FPS\":","\"\",","\"pos\":","[],","\"rot\":","[]","} ","",""]
[null,null,null,null," ","{","","\"FPS\":","\"\",","\"pos\":","[],","\"rot\":","[]","} ","",""]
[null,null,null,null," ","{","","\"FPS\":","\"\",","\"pos\":","[],","\"rot\":","[]","} ","",""]
[null,null,null,null," ","{","","\"FPS\":","\"\",","\"pos\":","[],","\"rot\":","[]","} ","",""]
[null,null,null,null," ","{","","\"FPS\":","\"\",","\"pos\":","[],","\"rot\":","[]","} ","",""]
[null,null,null,null," ","{","","\"FPS\":","\"\",","\"pos\":","[],","\"rot\":","[]","} ","",""]
[null,null,null,null," ","{","","\"FPS\":","\"\",","\"pos\":","[],","\"rot\":","[]","} ","",""]
[null,null,null,null," ","{","","\"FPS\":","\"\",","\"pos\":","[],","\"rot\":","[]","} ","",""]
[null,null,null,null," ","{","","\"FPS\":","\"\",","\"pos\":","[],","\"rot\":","[]","} ","",""]
[null,null,null,null," ","{","","\"FPS\":","\"\",","\"pos\":","[],","\"rot\":","[]","} ","",""]
[null,null,null,null," ","{","","\"FPS\":","\"\",","\"pos\":","[],","\"rot\":","[]","} ","",""]
[null,null,null,null," ","{","","\"FPS\":","\"\",","\"pos\":","[],","\"rot\":","[]","} ","",""]
[null,null,null,null," ","{","","\"FPS\":","\"\",","\"pos\":","[],","\"rot\":","[]","} ","",""]
[null,null,null,null," ","{","","\"FPS\":","\"\",","\"pos\":","[],","\"rot\":","[]","} ","",""]
[null,null,null,null," ","{","","\"FPS\":","\"\",","\"pos\":","[],","\"rot\":","[]","} ","",""]
[null,null,null,null," ","{","","\"FPS\":","\"\",","\"pos\":","[],","\"rot\":","[]","} ","",""]
[null,null,null,null," ","{","","\"FPS\":","\"\",","\"pos\":","[],","\"rot\":","[]","} ","",""]
[null,null,null,null," ","{","","\"FPS\":","\"\",","\"pos\":","[],","\"rot\":","[]","} ","",""]
[null,null,null,null," ","{","","\"FPS\":","\"\",","\"pos\":","[],","\"rot\":","[]","} ","",""]
[null,null,null,null," ","{","","\"FPS\":","\"\",","\"pos\":","[],","\"rot\":","[]","} ","",""]
[null,null,null,null," ","{",{"$f":"IF(A1157<>\"\",CONCATENATE(\"\"\"\",A$3,\"\"\": \"\"\",A1157,\"\"\", \"),\"\")","v":""},"\"FPS\":",{"$f":"CONCATENATE(\"\"\"\",B1157,\"\"\"\",\",\")","v":"\"\","},"\"pos\":",{"$f":"CONCATENATE(\"[\",C1157,\"]\",\",\")","v":"[],"},"\"rot\":",{"$f":"CONCATENATE(\"[\",D1157,\"]\")","v":"[]"},"} ",{"$f":"IF(A1157<>\"\",CONCATENATE(F1157,G1157,H1157,I1157,J1157,K1157,L1157,M1157,N1157),\"\")","v":""},{"$f":"CONCATENATE(IF(AND(P1156<>\"\",Q1156=\"\"),CONCATENATE(P1156,IF(A1157<>\"\",\",\",\"\")),\"\"),O1157)","v":""}]
[null,null,null,null," ","{","","\"FPS\":","\"\",","\"pos\":","[],","\"rot\":","[]","} ","",""]
[null,null,null,null," ","{","","\"FPS\":","\"\",","\"pos\":","[],","\"rot\":","[]","} ","",""]
[null,null,null,null," ","{","","\"FPS\":","\"\",","\"pos\":","[],","\"rot\":","[]","} ","",""]
[null,null,null,null," ","{","","\"FPS\":","\"\",","\"pos\":","[],","\"rot\":","[]","} ","",""]
[null,null,null,null," ","{","","\"FPS\":","\"\",","\"pos\":","[],","\"rot\":","[]","} ","",""]
[null,null,null,null," ","{","","\"FPS\":","\"\",","\"pos\":","[],","\"rot\":","[]","} ","",""]
[null,null,null,null," ","{","","\"FPS\":","\"\",","\"pos\":","[],","\"rot\":","[]","} ","",""]
[null,null,null,null," ","{","","\"FPS\":","\"\",","\"pos\":","[],","\"rot\":","[]","} ","",""]
[null,null,null,null," ","{","","\"FPS\":","\"\",","\"pos\":","[],","\"rot\":","[]","} ","",""]
[null,null,null,null," ","{","","\"FPS\":","\"\",","\"pos\":","[],","\"rot\":","[]","} ","",""]
[null,null,null,null," ","{","","\"FPS\":","\"\",","\"pos\":","[],","\"rot\":","[]","} ","",""]
[null,null,null,null," ","{","","\"FPS\":","\"\",","\"pos\":","[],","\"rot\":","[]","} ","",""]
[null,null,null,null," ","{","","\"FPS\":","\"\",","\"pos\":","[],","\"rot\":","[]","} ","",""]
[null,null,null,null," ","{","","\"FPS\":","\"\",","\"pos\":","[],","\"rot\":","[]","} ","",""]
[null,null,null,null," ","{","","\"FPS\":","\"\",","\"pos\":","[],","\"rot\":","[]","} ","",""]
[null,null,null,null," ","{","","\"FPS\":","\"\",","\"pos\":","[],","\"rot\":","[]","} ","",""]
[null,null,null,null," ","{","","\"FPS\":","\"\",","\"pos\":","[],","\"rot\":","[]","} ","",""]
[null,null,null,null," ","{","","\"FPS\":","\"\",","\"pos\":","[],","\"rot\":","[]","} ","",""]
[null,null,null,null," ","{","","\"FPS\":","\"\",","\"pos\":","[],","\"rot\":","[]","} ","",""]
[null,null,null,null," ","{","","\"FPS\":","\"\",","\"pos\":","[],","\"rot\":","[]","} ","",""]
[null,null,null,null," ","{","","\"FPS\":","\"\",","\"pos\":","[],","\"rot\":","[]","} ","",""]
[null,null,null,null," ","{","","\"FPS\":","\"\",","\"pos\":","[],","\"rot\":","[]","} ","",""]
[null,null,null,null," ","{","","\"FPS\":","\"\",","\"pos\":","[],","\"rot\":","[]","} ","",""]
[null,null,null,null," ","{","","\"FPS\":","\"\",","\"pos\":","[],","\"rot\":","[]","} ","",""]
[null,null,null,null," ","{","","\"FPS\":","\"\",","\"pos\":","[],","\"rot\":","[]","} ","",""]
[null,null,null,null," ","{","","\"FPS\":","\"\",","\"pos\":","[],","\"rot\":","[]","} ","",""]
[null,null,null,null," ","{","","\"FPS\":","\"\",","\"pos\":","[],","\"rot\":","[]","} ","",""]
[null,null,null,null," ","{","","\"FPS\":","\"\",","\"pos\":","[],","\"rot\":","[]","} ","",""]
[null,null,null,null," ","{","","\"FPS\":","\"\",","\"pos\":","[],","\"rot\":","[]","} ","",""]
[null,null,null,null," ","{","","\"FPS\":","\"\",","\"pos\":","[],","\"rot\":","[]","} ","",""]
[null,null,null,null," ","{","","\"FPS\":","\"\",","\"pos\":","[],","\"rot\":","[]","} ","",""]
[null,null,null,null," ","{","","\"FPS\":","\"\",","\"pos\":","[],","\"rot\":","[]","} ","",""]
[null,null,null,null," ","{","","\"FPS\":","\"\",","\"pos\":","[],","\"rot\":","[]","} ","",""]
[null,null,null,null," ","{","","\"FPS\":","\"\",","\"pos\":","[],","\"rot\":","[]","} ","",""]
[null,null,null,null," ","{","","\"FPS\":","\"\",","\"pos\":","[],","\"rot\":","[]","} ","",""]
[null,null,null,null," ","{","","\"FPS\":","\"\",","\"pos\":","[],","\"rot\":","[]","} ","",""]
[null,null,null,null," ","{","","\"FPS\":","\"\",","\"pos\":","[],","\"rot\":","[]","} ","",""]
[null,null,null,null," ","{","","\"FPS\":","\"\",","\"pos\":","[],","\"rot\":","[]","} ","",""]
[null,null,null,null," ","{","","\"FPS\":","\"\",","\"pos\":","[],","\"rot\":","[]","} ","",""]
[null,null,null,null," ","{","","\"FPS\":","\"\",","\"pos\":","[],","\"rot\":","[]","} ","",""]
[null,null,null,null," ","{","","\"FPS\":","\"\",","\"pos\":","[],","\"rot\":","[]","} ","",""]
[null,null,null,null," ","{","","\"FPS\":","\"\",","\"pos\":","[],","\"rot\":","[]","} ","",""]
[null,null,null,null," ","{","","\"FPS\":","\"\",","\"pos\":","[],","\"rot\":","[]","} ","",""]
[null,null,null,null," ","{","","\"FPS\":","\"\",","\"pos\":","[],","\"rot\":","[]","} ","",""]
[null,null,null,null," ","{","","\"FPS\":","\"\",","\"pos\":","[],","\"rot\":","[]","} ","",""]
[null,null,null,null," ","{","","\"FPS\":","\"\",","\"pos\":","[],","\"rot\":","[]","} ","",""]
[null,null,null,null," ","{","","\"FPS\":","\"\",","\"pos\":","[],","\"rot\":","[]","} ","",""]
[null,null,null,null," ","{","","\"FPS\":","\"\",","\"pos\":","[],","\"rot\":","[]","} ","",""]
[null,null,null,null," ","{","","\"FPS\":","\"\",","\"pos\":","[],","\"rot\":","[]","} ","",""]
[null,null,null,null," ","{","","\"FPS\":","\"\",","\"pos\":","[],","\"rot\":","[]","} ","",""]
[null,null,null,null," ","{","","\"FPS\":","\"\",","\"pos\":","[],","\"rot\":","[]","} ","",""]
[null,null,null,null," ","{","","\"FPS\":","\"\",","\"pos\":","[],","\"rot\":","[]","} ","",""]
[null,null,null,null," ","{","","\"FPS\":","\"\",","\"pos\":","[],","\"rot\":","[]","} ","",""]
[null,null,null,null," ","{","","\"FPS\":","\"\",","\"pos\":","[],","\"rot\":","[]","} ","",""]
[null,null,null,null," ","{","","\"FPS\":","\"\",","\"pos\":","[],","\"rot\":","[]","} ","",""]
[null,null,null,null," ","{","","\"FPS\":","\"\",","\"pos\":","[],","\"rot\":","[]","} ","",""]
[null,null,null,null," ","{","","\"FPS\":","\"\",","\"pos\":","[],","\"rot\":","[]","} ","",""]
[null,null,null,null," ","{","","\"FPS\":","\"\",","\"pos\":","[],","\"rot\":","[]","} ","",""]
[null,null,null,null," ","{","","\"FPS\":","\"\",","\"pos\":","[],","\"rot\":","[]","} ","",""]
[null,null,null,null," ","{","","\"FPS\":","\"\",","\"pos\":","[],","\"rot\":","[]","} ","",""]
[null,null,null,null," ","{","","\"FPS\":","\"\",","\"pos\":","[],","\"rot\":","[]","} ","",""]
[null,null,null,null," ","{","","\"FPS\":","\"\",","\"pos\":","[],","\"rot\":","[]","} ","",""]
[null,null,null,null," ","{","","\"FPS\":","\"\",","\"pos\":","[],","\"rot\":","[]","} ","",""]
[null,null,null,null," ","{",{"$f":"IF(A1221<>\"\",CONCATENATE(\"\"\"\",A$3,\"\"\": \"\"\",A1221,\"\"\", \"),\"\")","v":""},"\"FPS\":",{"$f":"CONCATENATE(\"\"\"\",B1221,\"\"\"\",\",\")","v":"\"\","},"\"pos\":",{"$f":"CONCATENATE(\"[\",C1221,\"]\",\",\")","v":"[],"},"\"rot\":",{"$f":"CONCATENATE(\"[\",D1221,\"]\")","v":"[]"},"} ",{"$f":"IF(A1221<>\"\",CONCATENATE(F1221,G1221,H1221,I1221,J1221,K1221,L1221,M1221,N1221),\"\")","v":""},{"$f":"CONCATENATE(IF(AND(P1220<>\"\",Q1220=\"\"),CONCATENATE(P1220,IF(A1221<>\"\",\",\",\"\")),\"\"),O1221)","v":""}]
[null,null,null,null," ","{","","\"FPS\":","\"\",","\"pos\":","[],","\"rot\":","[]","} ","",""]
[null,null,null,null," ","{","","\"FPS\":","\"\",","\"pos\":","[],","\"rot\":","[]","} ","",""]
[null,null,null,null," ","{","","\"FPS\":","\"\",","\"pos\":","[],","\"rot\":","[]","} ","",""]
[null,null,null,null," ","{","","\"FPS\":","\"\",","\"pos\":","[],","\"rot\":","[]","} ","",""]
[null,null,null,null," ","{","","\"FPS\":","\"\",","\"pos\":","[],","\"rot\":","[]","} ","",""]
[null,null,null,null," ","{","","\"FPS\":","\"\",","\"pos\":","[],","\"rot\":","[]","} ","",""]
[null,null,null,null," ","{","","\"FPS\":","\"\",","\"pos\":","[],","\"rot\":","[]","} ","",""]
[null,null,null,null," ","{","","\"FPS\":","\"\",","\"pos\":","[],","\"rot\":","[]","} ","",""]
[null,null,null,null," ","{","","\"FPS\":","\"\",","\"pos\":","[],","\"rot\":","[]","} ","",""]
[null,null,null,null," ","{","","\"FPS\":","\"\",","\"pos\":","[],","\"rot\":","[]","} ","",""]
[null,null,null,null," ","{","","\"FPS\":","\"\",","\"pos\":","[],","\"rot\":","[]","} ","",""]
[null,null,null,null," ","{","","\"FPS\":","\"\",","\"pos\":","[],","\"rot\":","[]","} ","",""]
[null,null,null,null," ","{","","\"FPS\":","\"\",","\"pos\":","[],","\"rot\":","[]","} ","",""]
[null,null,null,null," ","{","","\"FPS\":","\"\",","\"pos\":","[],","\"rot\":","[]","} ","",""]
[null,null,null,null," ","{","","\"FPS\":","\"\",","\"pos\":","[],","\"rot\":","[]","} ","",""]
[null,null,null,null," ","{","","\"FPS\":","\"\",","\"pos\":","[],","\"rot\":","[]","} ","",""]
[null,null,null,null," ","{","","\"FPS\":","\"\",","\"pos\":","[],","\"rot\":","[]","} ","",""]
[null,null,null,null," ","{","","\"FPS\":","\"\",","\"pos\":","[],","\"rot\":","[]","} ","",""]
[null,null,null,null," ","{","","\"FPS\":","\"\",","\"pos\":","[],","\"rot\":","[]","} ","",""]
[null,null,null,null," ","{","","\"FPS\":","\"\",","\"pos\":","[],","\"rot\":","[]","} ","",""]
[null,null,null,null," ","{","","\"FPS\":","\"\",","\"pos\":","[],","\"rot\":","[]","} ","",""]
[null,null,null,null," ","{","","\"FPS\":","\"\",","\"pos\":","[],","\"rot\":","[]","} ","",""]
[null,null,null,null," ","{","","\"FPS\":","\"\",","\"pos\":","[],","\"rot\":","[]","} ","",""]
[null,null,null,null," ","{","","\"FPS\":","\"\",","\"pos\":","[],","\"rot\":","[]","} ","",""]
[null,null,null,null," ","{","","\"FPS\":","\"\",","\"pos\":","[],","\"rot\":","[]","} ","",""]
[null,null,null,null," ","{","","\"FPS\":","\"\",","\"pos\":","[],","\"rot\":","[]","} ","",""]
[null,null,null,null," ","{","","\"FPS\":","\"\",","\"pos\":","[],","\"rot\":","[]","} ","","",6]

{"sheet":"Sim","index":4,"n_rows":29,"n_cols":19,"rows_kept":29,"cut":false,"hidden":false,"merged":[]}
[]
[]
[null,"id","time","property","value1","value2",null,null,null,null,null,null,null,null,null,null,null,{"$f":"CONCATENATE(B3,\",\",C3,\",\",D3,\",\",E3,\",\",F3)","v":"id,time,property,value1,value2"},{"$f":"CONCATENATE(IF(AND(S2<>\"\",T2=\"\"),CONCATENATE(S2,\",\"),\"\"),R3)","v":"id,time,property,value1,value2"}]
[null,"parttypeA_1",0,"place","enter","B1",null,"{",{"$f":"IF(B4<>\"\",CONCATENATE(\"\"\"\",B$3,\"\"\": \"\"\",$C$2,B4,\"\"\"\"),\"\")","v":"\"id\": \"parttypeA_1\""},{"$f":"IF(C4<>\"\",CONCATENATE(\",\"\"\",C$3,\"\"\": \",C4,\"\"),\"\")","v":",\"time\": 0"},{"$f":"IF(D4<>\"\",CONCATENATE(\",\"\"\",D$3,\"\"\": \"\"\",D4,\"\"\"\"),\"\")","v":",\"property\": \"place\""},{"$f":"IF(E4<>\"\",CONCATENATE(\",\"\"\",E$3,\"\"\": \"\"\",E4,\"\"\"\"),\"\")","v":",\"value1\": \"enter\""},{"$f":"IF(F4<>\"\",CONCATENATE(\",\"\"\",F$3,\"\"\": \"\"\",$C$2,F4,\"\"\"\"),\"\")","v":",\"value2\": \"B1\""},"}",{"$f":"CONCATENATE(H4,I4,J4,K4,L4,M4,N4)","v":"{\"id\": \"parttypeA_1\",\"time\": 0,\"property\": \"place\",\"value1\": \"enter\",\"value2\": \"B1\"}"},{"$f":"CONCATENATE(IF(AND(P3<>\"\",Q3=\"\"),CONCATENATE(P3,\",\"),\"\"),O4)","v":"{\"id\": \"parttypeA_1\",\"time\": 0,\"property\": \"place\",\"value1\": \"enter\",\"value2\": \"B1\"}"},null,{"$f":"CONCATENATE(B4,\",\",C4,\",\",D4,\",\",E4,\",\",F4)","v":"parttypeA_1,0,place,enter,B1"},{"$f":"CONCATENATE(IF(AND(S3<>\"\",T3=\"\"),CONCATENATE(S3,\",\"),\"\"),R4)","v":"id,time,property,value1,value2,parttypeA_1,0,place,enter,B1"}]
[null,"parttypeA_1",1,"place","exit","B1",null,"{",{"$f":"IF(B5<>\"\",CONCATENATE(\"\"\"\",B$3,\"\"\": \"\"\",$C$2,B5,\"\"\"\"),\"\")","v":"\"id\": \"parttypeA_1\""},{"$f":"IF(C5<>\"\",CONCATENATE(\",\"\"\",C$3,\"\"\": \",C5,\"\"),\"\")","v":",\"time\": 1"},{"$f":"IF(D5<>\"\",CONCATENATE(\",\"\"\",D$3,\"\"\": \"\"\",D5,\"\"\"\"),\"\")","v":",\"property\": \"place\""},{"$f":"IF(E5<>\"\",CONCATENATE(\",\"\"\",E$3,\"\"\": \"\"\",E5,\"\"\"\"),\"\")","v":",\"value1\": \"exit\""},{"$f":"IF(F5<>\"\",CONCATENATE(\",\"\"\",F$3,\"\"\": \"\"\",$C$2,F5,\"\"\"\"),\"\")","v":",\"value2\": \"B1\""},"}",{"$f":"CONCATENATE(H5,I5,J5,K5,L5,M5,N5)","v":"{\"id\": \"parttypeA_1\",\"time\": 1,\"property\": \"place\",\"value1\": \"exit\",\"value2\": \"B1\"}"},{"$f":"CONCATENATE(IF(AND(P4<>\"\",Q4=\"\"),CONCATENATE(P4,\",\"),\"\"),O5)","v":"{\"id\": \"parttypeA_1\",\"time\": 0,\"property\": \"place\",\"value1\": \"enter\",\"value2\": \"B1\"},{\"id\": \"parttypeA_1\",\"time\": 1,\"property\": \"place\",\"value1\": \"exit\",\"value2\": \"B1\"}"},null,{"$f":"CONCATENATE(B5,\",\",C5,\",\",D5,\",\",E5,\",\",F5)","v":"parttypeA_1,1,place,exit,B1"},{"$f":"CONCATENATE(IF(AND(S4<>\"\",T4=\"\"),CONCATENATE(S4,\",\"),\"\"),R5)","v":"id,time,property,value1,value2,parttypeA_1,0,place,enter,B1,parttypeA_1,1,place,exit,B1"}]
[null,"parttypeA_1",1.1000000000000001,"place","enter","M1",null,"{","\"id\": \"parttypeA_1\"",",\"time\": 1,1",",\"property\": \"place\"",",\"value1\": \"enter\"",",\"value2\": \"M1\"","}","{\"id\": \"parttypeA_1\",\"time\": 1,1,\"property\": \"place\",\"value1\": \"enter\",\"value2\": \"M1\"}","{\"id\": \"parttypeA_1\",\"time\": 0,\"property\": \"place\",\"value1\": \"enter\",\"value2\": \"B1\"},{\"id\": \"parttypeA_1\",\"time\": 1,\"property\": \"place\",\"value1\": \"exit\",\"value2\": \"B1\"},{\"id\": \"parttypeA_1\",\"time\": 1,1,\"property\": \"place\",\"value1\": \"enter\",\"value2\": \"M1\"}",null,"parttypeA_1,1,1,place,enter,M1","id,time,property,value1,value2,parttypeA_1,0,place,enter,B1,parttypeA_1,1,place,exit,B1,parttypeA_1,1,1,place,enter,M1"]
[null,"parttypeA_1",2,"place","exit","M1",null,"{","\"id\": \"parttypeA_1\"",",\"time\": 2",",\"property\": \"place\"",",\"value1\": \"exit\"",",\"value2\": \"M1\"","}","{\"id\": \"parttypeA_1\",\"time\": 2,\"property\": \"place\",\"value1\": \"exit\",\"value2\": \"M1\"}","{\"id\": \"parttypeA_1\",\"time\": 0,\"property\": \"place\",\"value1\": \"enter\",\"value2\": \"B1\"},{\"id\": \"parttypeA_1\",\"time\": 1,\"property\": \"place\",\"value1\": \"exit\",\"value2\": \"B1\"},{\"id\": \"parttypeA_1\",\"time\": 1,1,\"property\": \"place\",\"value1\": \"enter\",\"value2\": \"M1\"},{\"id\": \"parttypeA_1\",\"time\": 2,\"property\": \"place\",\"value1\": \"exit\",\"value2\": \"M1\"}",null,"parttypeA_1,2,place,exit,M1","id,time,property,value1,value2,parttypeA_1,0,place,enter,B1,parttypeA_1,1,place,exit,B1,parttypeA_1,1,1,place,enter,M1,parttypeA_1,2,place,exit,M1"]
[null,"parttypeA_1",2,"place","enter","B3",null,"{","\"id\": \"parttypeA_1\"",",\"time\": 2",",\"property\": \"place\"",",\"value1\": \"enter\"",",\"value2\": \"B3\"","}","{\"id\": \"parttypeA_1\",\"time\": 2,\"property\": \"place\",\"value1\": \"enter\",\"value2\": \"B3\"}","{\"id\": \"parttypeA_1\",\"time\": 0,\"property\": \"place\",\"value1\": \"enter\",\"value2\": \"B1\"},{\"id\": \"parttypeA_1\",\"time\": 1,\"property\": \"place\",\"value1\": \"exit\",\"value2\": \"B1\"},{\"id\": \"parttypeA_1\",\"time\": 1,1,\"property\": \"place\",\"value1\": \"enter\",\"value2\": \"M1\"},{\"id\": \"parttypeA_1\",\"time\": 2,\"property\": \"place\",\"value1\": \"exit\",\"value2\": \"M1\"},{\"id\": \"parttypeA_1\",\"time\": 2,\"property\": \"place\",\"value1\": \"enter\",\"value2\": \"B3\"}",null,"parttypeA_1,2,place,enter,B3","id,time,property,value1,value2,parttypeA_1,0,place,enter,B1,parttypeA_1,1,place,exit,B1,parttypeA_1,1,1,place,enter,M1,parttypeA_1,2,place,exit,M1,parttypeA_1,2,place,enter,B3"]
[null,"parttypeA_1",3,"place","exit","B3",null,"{","\"id\": \"parttypeA_1\"",",\"time\": 3",",\"property\": \"place\"",",\"value1\": \"exit\"",",\"value2\": \"B3\"","}","{\"id\": \"parttypeA_1\",\"time\": 3,\"property\": \"place\",\"value1\": \"exit\",\"value2\": \"B3\"}","{\"id\": \"parttypeA_1\",\"time\": 0,\"property\": \"place\",\"value1\": \"enter\",\"value2\": \"B1\"},{\"id\": \"parttypeA_1\",\"time\": 1,\"property\": \"place\",\"value1\": \"exit\",\"value2\": \"B1\"},{\"id\": \"parttypeA_1\",\"time\": 1,1,\"property\": \"place\",\"value1\": \"enter\",\"value2\": \"M1\"},{\"id\": \"parttypeA_1\",\"time\": 2,\"property\": \"place\",\"value1\": \"exit\",\"value2\": \"M1\"},{\"id\": \"parttypeA_1\",\"time\": 2,\"property\": \"place\",\"value1\": \"enter\",\"value2\": \"B3\"},{\"id\": \"parttypeA_1\",\"time\": 3,\"property\": \"place\",\"value1\": \"exit\",\"value2\": \"B3\"}",null,"parttypeA_1,3,place,exit,B3","id,time,property,value1,value2,parttypeA_1,0,place,enter,B1,parttypeA_1,1,place,exit,B1,parttypeA_1,1,1,place,enter,M1,parttypeA_1,2,place,exit,M1,parttypeA_1,2,place,enter,B3,parttypeA_1,3,place,exit,B3"]
[null,"parttypeA_1",3,"place","enter","M2",null,"{","\"id\": \"parttypeA_1\"",",\"time\": 3",",\"property\": \"place\"",",\"value1\": \"enter\"",",\"value2\": \"M2\"","}","{\"id\": \"parttypeA_1\",\"time\": 3,\"property\": \"place\",\"value1\": \"enter\",\"value2\": \"M2\"}","{\"id\": \"parttypeA_1\",\"time\": 0,\"property\": \"place\",\"value1\": \"enter\",\"value2\": \"B1\"},{\"id\": \"parttypeA_1\",\"time\": 1,\"property\": \"place\",\"value1\": \"exit\",\"value2\": \"B1\"},{\"id\": \"parttypeA_1\",\"time\": 1,1,\"property\": \"place\",\"value1\": \"enter\",\"value2\": \"M1\"},{\"id\": \"parttypeA_1\",\"time\": 2,\"property\": \"place\",\"value1\": \"exit\",\"value2\": \"M1\"},{\"id\": \"parttypeA_1\",\"time\": 2,\"property\": \"place\",\"value1\": \"enter\",\"value2\": \"B3\"},{\"id\": \"parttypeA_1\",\"time\": 3,\"property\": \"place\",\"value1\": \"exit\",\"value2\": \"B3\"},{\"id\": \"parttypeA_1\",\"time\": 3,\"property\": \"place\",\"value1\": \"enter\",\"value2\": \"M2\"}",null,"parttypeA_1,3,place,enter,M2","id,time,property,value1,value2,parttypeA_1,0,place,enter,B1,parttypeA_1,1,place,exit,B1,parttypeA_1,1,1,place,enter,M1,parttypeA_1,2,place,exit,M1,parttypeA_1,2,place,enter,B3,parttypeA_1,3,place,exit,B3,parttypeA_1,3,place,enter,M2"]
[null,"parttypeA_1",4,"place","exit","M2",null,"{","\"id\": \"parttypeA_1\"",",\"time\": 4",",\"property\": \"place\"",",\"value1\": \"exit\"",",\"value2\": \"M2\"","}","{\"id\": \"parttypeA_1\",\"time\": 4,\"property\": \"place\",\"value1\": \"exit\",\"value2\": \"M2\"}","{\"id\": \"parttypeA_1\",\"time\": 0,\"property\": \"place\",\"value1\": \"enter\",\"value2\": \"B1\"},{\"id\": \"parttypeA_1\",\"time\": 1,\"property\": \"place\",\"value1\": \"exit\",\"value2\": \"B1\"},{\"id\": \"parttypeA_1\",\"time\": 1,1,\"property\": \"place\",\"value1\": \"enter\",\"value2\": \"M1\"},{\"id\": \"parttypeA_1\",\"time\": 2,\"property\": \"place\",\"value1\": \"exit\",\"value2\": \"M1\"},{\"id\": \"parttypeA_1\",\"time\": 2,\"property\": \"place\",\"value1\": \"enter\",\"value2\": \"B3\"},{\"id\": \"parttypeA_1\",\"time\": 3,\"property\": \"place\",\"value1\": \"exit\",\"value2\": \"B3\"},{\"id\": \"parttypeA_1\",\"time\": 3,\"property\": \"place\",\"value1\": \"enter\",\"value2\": \"M2\"},{\"id\": \"parttypeA_1\",\"time\": 4,\"property\": \"place\",\"value1\": \"exit\",\"value2\": \"M2\"}",null,"parttypeA_1,4,place,exit,M2","id,time,property,value1,value2,parttypeA_1,0,place,enter,B1,parttypeA_1,1,place,exit,B1,parttypeA_1,1,1,place,enter,M1,parttypeA_1,2,place,exit,M1,parttypeA_1,2,place,enter,B3,parttypeA_1,3,place,exit,B3,parttypeA_1,3,place,enter,M2,parttypeA_1,4,place,exit,M2"]
[null,"parttypeA_1",4,"place","enter","B5",null,"{","\"id\": \"parttypeA_1\"",",\"time\": 4",",\"property\": \"place\"",",\"value1\": \"enter\"",",\"value2\": \"B5\"","}","{\"id\": \"parttypeA_1\",\"time\": 4,\"property\": \"place\",\"value1\": \"enter\",\"value2\": \"B5\"}","{\"id\": \"parttypeA_1\",\"time\": 0,\"property\": \"place\",\"value1\": \"enter\",\"value2\": \"B1\"},{\"id\": \"parttypeA_1\",\"time\": 1,\"property\": \"place\",\"value1\": \"exit\",\"value2\": \"B1\"},{\"id\": \"parttypeA_1\",\"time\": 1,1,\"property\": \"place\",\"value1\": \"enter\",\"value2\": \"M1\"},{\"id\": \"parttypeA_1\",\"time\": 2,\"property\": \"place\",\"value1\": \"exit\",\"value2\": \"M1\"},{\"id\": \"parttypeA_1\",\"time\": 2,\"property\": \"place\",\"value1\": \"enter\",\"value2\": \"B3\"},{\"id\": \"parttypeA_1\",\"time\": 3,\"property\": \"place\",\"value1\": \"exit\",\"value2\": \"B3\"},{\"id\": \"parttypeA_1\",\"time\": 3,\"property\": \"place\",\"value1\": \"enter\",\"value2\": \"M2\"},{\"id\": \"parttypeA_1\",\"time\": 4,\"property\": \"place\",\"value1\": \"exit\",\"value2\": \"M2\"},{\"id\": \"parttypeA_1\",\"time\": 4,\"property\": \"place\",\"value1\": \"enter\",\"value2\": \"B5\"}",null,"parttypeA_1,4,place,enter,B5","id,time,property,value1,value2,parttypeA_1,0,place,enter,B1,parttypeA_1,1,place,exit,B1,parttypeA_1,1,1,place,enter,M1,parttypeA_1,2,place,exit,M1,parttypeA_1,2,place,enter,B3,parttypeA_1,3,place,exit,B3,parttypeA_1,3,place,enter,M2,parttypeA_1,4,place,exit,M2,parttypeA_1,4,place,enter,B5"]
[null,"parttypeA_1",5.0999999999999996,"place","exit","B5",null,"{","\"id\": \"parttypeA_1\"",",\"time\": 5,1",",\"property\": \"place\"",",\"value1\": \"exit\"",",\"value2\": \"B5\"","}","{\"id\": \"parttypeA_1\",\"time\": 5,1,\"property\": \"place\",\"value1\": \"exit\",\"value2\": \"B5\"}",{"$f":"CONCATENATE(IF(AND(P12<>\"\",Q12=\"\"),CONCATENATE(P12,\",\"),\"\"),O13)","v":"{\"id\": \"parttypeA_1\",\"time\": 0,\"property\": \"place\",\"value1\": \"enter\",\"value2\": \"B1\"},{\"id\": \"parttypeA_1\",\"time\": 1,\"property\": \"place\",\"value1\": \"exit\",\"value2\": \"B1\"},{\"id\": \"parttypeA_1\",\"time\": 1,1,\"property\": \"place\",\"value1\": \"enter\",\"value2\": \"M1\"},{\"id\": \"parttypeA_1\",\"time\": 2,\"property\": \"place\",\"value1\": \"exit\",\"value2\": \"M1\"},{\"id\": \"parttypeA_1\",\"time\": 2,\"property\": \"place\",\"value1\": \"enter\",\"value2\": \"B3\"},{\"id\": \"parttypeA_1\",\"time\": 3,\"property\": \"place\",\"value1\": \"exit\",\"value2\": \"B3\"},{\"id\": \"parttypeA_1\",\"time\": 3,\"property\": \"place\",\"value1\": \"enter\",\"value2\": \"M2\"},{\"id\": \"parttypeA_1\",\"time\": 4,\"property\": \"place\",\"value1\": \"exit\",\"value2\": \"M2\"},{\"id\": \"parttypeA_1\",\"time\": 4,\"property\": \"place\",\"value1\": \"enter\",\"value2\": \"B5\"},{\"id\": \"parttypeA_1\",\"time\": 5,1,\"property\": \"place\",\"value1\": \"exit\",\"value2\": \"B5\"}"},null,"parttypeA_1,5,1,place,exit,B5","id,time,property,value1,value2,parttypeA_1,0,place,enter,B1,parttypeA_1,1,place,exit,B1,parttypeA_1,1,1,place,enter,M1,parttypeA_1,2,place,exit,M1,parttypeA_1,2,place,enter,B3,parttypeA_1,3,place,exit,B3,parttypeA_1,3,place,enter,M2,parttypeA_1,4,place,exit,M2,parttypeA_1,4,place,enter,B5,parttypeA_1,5,1,place,exit,B5"]
[null,"parttypeA_2",1,"place","enter","B1",null,"{",{"$f":"IF(B14<>\"\",CONCATENATE(\"\"\"\",B$3,\"\"\": \"\"\",$C$2,B14,\"\"\"\"),\"\")","v":"\"id\": \"parttypeA_2\""},{"$f":"IF(C14<>\"\",CONCATENATE(\",\"\"\",C$3,\"\"\": \",C14,\"\"),\"\")","v":",\"time\": 1"},{"$f":"IF(D14<>\"\",CONCATENATE(\",\"\"\",D$3,\"\"\": \"\"\",D14,\"\"\"\"),\"\")","v":",\"property\": \"place\""},{"$f":"IF(E14<>\"\",CONCATENATE(\",\"\"\",E$3,\"\"\": \"\"\",E14,\"\"\"\"),\"\")","v":",\"value1\": \"enter\""},{"$f":"IF(F14<>\"\",CONCATENATE(\",\"\"\",F$3,\"\"\": \"\"\",$C$2,F14,\"\"\"\"),\"\")","v":",\"value2\": \"B1\""},"}",{"$f":"CONCATENATE(H14,I14,J14,K14,L14,M14,N14)","v":"{\"id\": \"parttypeA_2\",\"time\": 1,\"property\": \"place\",\"value1\": \"enter\",\"value2\": \"B1\"}"},{"$f":"CONCATENATE(IF(AND(P13<>\"\",Q13=\"\"),CONCATENATE(P13,\",\"),\"\"),O14)","v":"{\"id\": \"parttypeA_1\",\"time\": 0,\"property\": \"place\",\"value1\": \"enter\",\"value2\": \"B1\"},{\"id\": \"parttypeA_1\",\"time\": 1,\"property\": \"place\",\"value1\": \"exit\",\"value2\": \"B1\"},{\"id\": \"parttypeA_1\",\"time\": 1,1,\"property\": \"place\",\"value1\": \"enter\",\"value2\": \"M1\"},{\"id\": \"parttypeA_1\",\"time\": 2,\"property\": \"place\",\"value1\": \"exit\",\"value2\": \"M1\"},{\"id\": \"parttypeA_1\",\"time\": 2,\"property\": \"place\",\"value1\": \"enter\",\"value2\": \"B3\"},{\"id\": \"parttypeA_1\",\"time\": 3,\"property\": \"place\",\"value1\": \"exit\",\"value2\": \"B3\"},{\"id\": \"parttypeA_1\",\"time\": 3,\"property\": \"place\",\"value1\": \"enter\",\"value2\": \"M2\"},{\"id\": \"parttypeA_1\",\"time\": 4,\"property\": \"place\",\"value1\": \"exit\",\"value2\": \"M2\"},{\"id\": \"parttypeA_1\",\"time\": 4,\"property\": \"place\",\"value1\": \"enter\",\"value2\": \"B5\"},{\"id\": \"parttypeA_1\",\"time\": 5,1,\"property\": \"place\",\"value1\": \"exit\",\"value2\": \"B5\"},{\"id\": \"parttypeA_2\",\"time\": 1,\"property\": \"place\",\"value1\": \"enter\",\"value2\": \"B1\"}"},null,{"$f":"CONCATENATE(B14,\",\",C14,\",\",D14,\",\",E14,\",\",F14)","v":"parttypeA_2,1,place,enter,B1"},{"$f":"CONCATENATE(IF(AND(S13<>\"\",T13=\"\"),CONCATENATE(S13,\",\"),\"\"),R14)","v":"id,time,property,value1,value2,parttypeA_1,0,place,enter,B1,parttypeA_1,1,place,exit,B1,parttypeA_1,1,1,place,enter,M1,parttypeA_1,2,place,exit,M1,parttypeA_1,2,place,enter,B3,parttypeA_1,3,place,exit,B3,parttypeA_1,3,place,enter,M2,parttypeA_1,4,place,exit,M2,parttypeA_1,4,place,enter,B5,parttypeA_1,5,1,place,exit,B5,parttypeA_2,1,place,enter,B1"}]
[null,"parttypeA_3",1.5,"place","enter","B1",null,"{",{"$f":"IF(B15<>\"\",CONCATENATE(\"\"\"\",B$3,\"\"\": \"\"\",$C$2,B15,\"\"\"\"),\"\")","v":"\"id\": \"parttypeA_3\""},{"$f":"IF(C15<>\"\",CONCATENATE(\",\"\"\",C$3,\"\"\": \",C15,\"\"),\"\")","v":",\"time\": 1,5"},{"$f":"IF(D15<>\"\",CONCATENATE(\",\"\"\",D$3,\"\"\": \"\"\",D15,\"\"\"\"),\"\")","v":",\"property\": \"place\""},{"$f":"IF(E15<>\"\",CONCATENATE(\",\"\"\",E$3,\"\"\": \"\"\",E15,\"\"\"\"),\"\")","v":",\"value1\": \"enter\""},{"$f":"IF(F15<>\"\",CONCATENATE(\",\"\"\",F$3,\"\"\": \"\"\",$C$2,F15,\"\"\"\"),\"\")","v":",\"value2\": \"B1\""},"}",{"$f":"CONCATENATE(H15,I15,J15,K15,L15,M15,N15)","v":"{\"id\": \"parttypeA_3\",\"time\": 1,5,\"property\": \"place\",\"value1\": \"enter\",\"value2\": \"B1\"}"},{"$f":"CONCATENATE(IF(AND(P14<>\"\",Q14=\"\"),CONCATENATE(P14,\",\"),\"\"),O15)","v":"{\"id\": \"parttypeA_1\",\"time\": 0,\"property\": \"place\",\"value1\": \"enter\",\"value2\": \"B1\"},{\"id\": \"parttypeA_1\",\"time\": 1,\"property\": \"place\",\"value1\": \"exit\",\"value2\": \"B1\"},{\"id\": \"parttypeA_1\",\"time\": 1,1,\"property\": \"place\",\"value1\": \"enter\",\"value2\": \"M1\"},{\"id\": \"parttypeA_1\",\"time\": 2,\"property\": \"place\",\"value1\": \"exit\",\"value2\": \"M1\"},{\"id\": \"parttypeA_1\",\"time\": 2,\"property\": \"place\",\"value1\": \"enter\",\"value2\": \"B3\"},{\"id\": \"parttypeA_1\",\"time\": 3,\"property\": \"place\",\"value1\": \"exit\",\"value2\": \"B3\"},{\"id\": \"parttypeA_1\",\"time\": 3,\"property\": \"place\",\"value1\": \"enter\",\"value2\": \"M2\"},{\"id\": \"parttypeA_1\",\"time\": 4,\"property\": \"place\",\"value1\": \"exit\",\"value2\": \"M2\"},{\"id\": \"parttypeA_1\",\"time\": 4,\"property\": \"place\",\"value1\": \"enter\",\"value2\": \"B5\"},{\"id\": \"parttypeA_1\",\"time\": 5,1,\"property\": \"place\",\"value1\": \"exit\",\"value2\": \"B5\"},{\"id\": \"parttypeA_2\",\"time\": 1,\"property\": \"place\",\"value1\": \"enter\",\"value2\": \"B1\"},{\"id\": \"parttypeA_3\",\"time\": 1,5,\"property\": \"place\",\"value1\": \"enter\",\"value2\": \"B1\"}"},null,{"$f":"CONCATENATE(B15,\",\",C15,\",\",D15,\",\",E15,\",\",F15)","v":"parttypeA_3,1,5,place,enter,B1"},{"$f":"CONCATENATE(IF(AND(S14<>\"\",T14=\"\"),CONCATENATE(S14,\",\"),\"\"),R15)","v":"id,time,property,value1,value2,parttypeA_1,0,place,enter,B1,parttypeA_1,1,place,exit,B1,parttypeA_1,1,1,place,enter,M1,parttypeA_1,2,place,exit,M1,parttypeA_1,2,place,enter,B3,parttypeA_1,3,place,exit,B3,parttypeA_1,3,place,enter,M2,parttypeA_1,4,place,exit,M2,parttypeA_1,4,place,enter,B5,parttypeA_1,5,1,place,exit,B5,parttypeA_2,1,place,enter,B1,parttypeA_3,1,5,place,enter,B1"}]
[null,"parttypeA_4",2.5,"place","enter","B1",null,"{","\"id\": \"parttypeA_4\"",",\"time\": 2,5",",\"property\": \"place\"",",\"value1\": \"enter\"",",\"value2\": \"B1\"","}","{\"id\": \"parttypeA_4\",\"time\": 2,5,\"property\": \"place\",\"value1\": \"enter\",\"value2\": \"B1\"}","{\"id\": \"parttypeA_1\",\"time\": 0,\"property\": \"place\",\"value1\": \"enter\",\"value2\": \"B1\"},{\"id\": \"parttypeA_1\",\"time\": 1,\"property\": \"place\",\"value1\": \"exit\",\"value2\": \"B1\"},{\"id\": \"parttypeA_1\",\"time\": 1,1,\"property\": \"place\",\"value1\": \"enter\",\"value2\": \"M1\"},{\"id\": \"parttypeA_1\",\"time\": 2,\"property\": \"place\",\"value1\": \"exit\",\"value2\": \"M1\"},{\"id\": \"parttypeA_1\",\"time\": 2,\"property\": \"place\",\"value1\": \"enter\",\"value2\": \"B3\"},{\"id\": \"parttypeA_1\",\"time\": 3,\"property\": \"place\",\"value1\": \"exit\",\"value2\": \"B3\"},{\"id\": \"parttypeA_1\",\"time\": 3,\"property\": \"place\",\"value1\": \"enter\",\"value2\": \"M2\"},{\"id\": \"parttypeA_1\",\"time\": 4,\"property\": \"place\",\"value1\": \"exit\",\"value2\": \"M2\"},{\"id\": \"parttypeA_1\",\"time\": 4,\"property\": \"place\",\"value1\": \"enter\",\"value2\": \"B5\"},{\"id\": \"parttypeA_1\",\"time\": 5,1,\"property\": \"place\",\"value1\": \"exit\",\"value2\": \"B5\"},{\"id\": \"parttypeA_2\",\"time\": 1,\"property\": \"place\",\"value1\": \"enter\",\"value2\": \"B1\"},{\"id\": \"parttypeA_3\",\"time\": 1,5,\"property\": \"place\",\"value1\": \"enter\",\"value2\": \"B1\"},{\"id\": \"parttypeA_4\",\"time\": 2,5,\"property\": \"place\",\"value1\": \"enter\",\"value2\": \"B1\"}",null,"parttypeA_4,2,5,place,enter,B1","id,time,property,value1,value2,parttypeA_1,0,place,enter,B1,parttypeA_1,1,place,exit,B1,parttypeA_1,1,1,place,enter,M1,parttypeA_1,2,place,exit,M1,parttypeA_1,2,place,enter,B3,parttypeA_1,3,place,exit,B3,parttypeA_1,3,place,enter,M2,parttypeA_1,4,place,exit,M2,parttypeA_1,4,place,enter,B5,parttypeA_1,5,1,place,exit,B5,parttypeA_2,1,place,enter,B1,parttypeA_3,1,5,place,enter,B1,parttypeA_4,2,5,place,enter,B1"]
[null,null,null,null,null,null,null,"{","","","","","","}","{}","{\"id\": \"parttypeA_1\",\"time\": 0,\"property\": \"place\",\"value1\": \"enter\",\"value2\": \"B1\"},{\"id\": \"parttypeA_1\",\"time\": 1,\"property\": \"place\",\"value1\": \"exit\",\"value2\": \"B1\"},{\"id\": \"parttypeA_1\",\"time\": 1,1,\"property\": \"place\",\"value1\": \"enter\",\"value2\": \"M1\"},{\"id\": \"parttypeA_1\",\"time\": 2,\"property\": \"place\",\"value1\": \"exit\",\"value2\": \"M1\"},{\"id\": \"parttypeA_1\",\"time\": 2,\"property\": \"place\",\"value1\": \"enter\",\"value2\": \"B3\"},{\"id\": \"parttypeA_1\",\"time\": 3,\"property\": \"place\",\"value1\": \"exit\",\"value2\": \"B3\"},{\"id\": \"parttypeA_1\",\"time\": 3,\"property\": \"place\",\"value1\": \"enter\",\"value2\": \"M2\"},{\"id\": \"parttypeA_1\",\"time\": 4,\"property\": \"place\",\"value1\": \"exit\",\"value2\": \"M2\"},{\"id\": \"parttypeA_1\",\"time\": 4,\"property\": \"place\",\"value1\": \"enter\",\"value2\": \"B5\"},{\"id\": \"parttypeA_1\",\"time\": 5,1,\"property\": \"place\",\"value1\": \"exit\",\"value2\": \"B5\"},{\"id\": \"parttypeA_2\",\"time\": 1,\"property\": \"place\",\"value1\": \"enter\",\"value2\": \"B1\"},{\"id\": \"parttypeA_3\",\"time\": 1,5,\"property\": \"place\",\"value1\": \"enter\",\"value2\": \"B1\"},{\"id\": \"parttypeA_4\",\"time\": 2,5,\"property\": \"place\",\"value1\": \"enter\",\"value2\": \"B1\"},{}",null,",,,,","id,time,property,value1,value2,parttypeA_1,0,place,enter,B1,parttypeA_1,1,place,exit,B1,parttypeA_1,1,1,place,enter,M1,parttypeA_1,2,place,exit,M1,parttypeA_1,2,place,enter,B3,parttypeA_1,3,place,exit,B3,parttypeA_1,3,place,enter,M2,parttypeA_1,4,place,exit,M2,parttypeA_1,4,place,enter,B5,parttypeA_1,5,1,place,exit,B5,parttypeA_2,1,place,enter,B1,parttypeA_3,1,5,place,enter,B1,parttypeA_4,2,5,place,enter,B1,,,,,"]
[null,null,null,null,null,null,null,"{","","","","","","}","{}","{\"id\": \"parttypeA_1\",\"time\": 0,\"property\": \"place\",\"value1\": \"enter\",\"value2\": \"B1\"},{\"id\": \"parttypeA_1\",\"time\": 1,\"property\": \"place\",\"value1\": \"exit\",\"value2\": \"B1\"},{\"id\": \"parttypeA_1\",\"time\": 1,1,\"property\": \"place\",\"value1\": \"enter\",\"value2\": \"M1\"},{\"id\": \"parttypeA_1\",\"time\": 2,\"property\": \"place\",\"value1\": \"exit\",\"value2\": \"M1\"},{\"id\": \"parttypeA_1\",\"time\": 2,\"property\": \"place\",\"value1\": \"enter\",\"value2\": \"B3\"},{\"id\": \"parttypeA_1\",\"time\": 3,\"property\": \"place\",\"value1\": \"exit\",\"value2\": \"B3\"},{\"id\": \"parttypeA_1\",\"time\": 3,\"property\": \"place\",\"value1\": \"enter\",\"value2\": \"M2\"},{\"id\": \"parttypeA_1\",\"time\": 4,\"property\": \"place\",\"value1\": \"exit\",\"value2\": \"M2\"},{\"id\": \"parttypeA_1\",\"time\": 4,\"property\": \"place\",\"value1\": \"enter\",\"value2\": \"B5\"},{\"id\": \"parttypeA_1\",\"time\": 5,1,\"property\": \"place\",\"value1\": \"exit\",\"value2\": \"B5\"},{\"id\": \"parttypeA_2\",\"time\": 1,\"property\": \"place\",\"value1\": \"enter\",\"value2\": \"B1\"},{\"id\": \"parttypeA_3\",\"time\": 1,5,\"property\": \"place\",\"value1\": \"enter\",\"value2\": \"B1\"},{\"id\": \"parttypeA_4\",\"time\": 2,5,\"property\": \"place\",\"value1\": \"enter\",\"value2\": \"B1\"},{},{}",null,",,,,","id,time,property,value1,value2,parttypeA_1,0,place,enter,B1,parttypeA_1,1,place,exit,B1,parttypeA_1,1,1,place,enter,M1,parttypeA_1,2,place,exit,M1,parttypeA_1,2,place,enter,B3,parttypeA_1,3,place,exit,B3,parttypeA_1,3,place,enter,M2,parttypeA_1,4,place,exit,M2,parttypeA_1,4,place,enter,B5,parttypeA_1,5,1,place,exit,B5,parttypeA_2,1,place,enter,B1,parttypeA_3,1,5,place,enter,B1,parttypeA_4,2,5,place,enter,B1,,,,,,,,,,"]
[null,null,null,null,null,null,null,"{","","","","","","}","{}","{\"id\": \"parttypeA_1\",\"time\": 0,\"property\": \"place\",\"value1\": \"enter\",\"value2\": \"B1\"},{\"id\": \"parttypeA_1\",\"time\": 1,\"property\": \"place\",\"value1\": \"exit\",\"value2\": \"B1\"},{\"id\": \"parttypeA_1\",\"time\": 1,1,\"property\": \"place\",\"value1\": \"enter\",\"value2\": \"M1\"},{\"id\": \"parttypeA_1\",\"time\": 2,\"property\": \"place\",\"value1\": \"exit\",\"value2\": \"M1\"},{\"id\": \"parttypeA_1\",\"time\": 2,\"property\": \"place\",\"value1\": \"enter\",\"value2\": \"B3\"},{\"id\": \"parttypeA_1\",\"time\": 3,\"property\": \"place\",\"value1\": \"exit\",\"value2\": \"B3\"},{\"id\": \"parttypeA_1\",\"time\": 3,\"property\": \"place\",\"value1\": \"enter\",\"value2\": \"M2\"},{\"id\": \"parttypeA_1\",\"time\": 4,\"property\": \"place\",\"value1\": \"exit\",\"value2\": \"M2\"},{\"id\": \"parttypeA_1\",\"time\": 4,\"property\": \"place\",\"value1\": \"enter\",\"value2\": \"B5\"},{\"id\": \"parttypeA_1\",\"time\": 5,1,\"property\": \"place\",\"value1\": \"exit\",\"value2\": \"B5\"},{\"id\": \"parttypeA_2\",\"time\": 1,\"property\": \"place\",\"value1\": \"enter\",\"value2\": \"B1\"},{\"id\": \"parttypeA_3\",\"time\": 1,5,\"property\": \"place\",\"value1\": \"enter\",\"value2\": \"B1\"},{\"id\": \"parttypeA_4\",\"time\": 2,5,\"property\": \"place\",\"value1\": \"enter\",\"value2\": \"B1\"},{},{},{}",null,",,,,","id,time,property,value1,value2,parttypeA_1,0,place,enter,B1,parttypeA_1,1,place,exit,B1,parttypeA_1,1,1,place,enter,M1,parttypeA_1,2,place,exit,M1,parttypeA_1,2,place,enter,B3,parttypeA_1,3,place,exit,B3,parttypeA_1,3,place,enter,M2,parttypeA_1,4,place,exit,M2,parttypeA_1,4,place,enter,B5,parttypeA_1,5,1,place,exit,B5,parttypeA_2,1,place,enter,B1,parttypeA_3,1,5,place,enter,B1,parttypeA_4,2,5,place,enter,B1,,,,,,,,,,,,,,,"]
[null,null,null,null,null,null,null,"{","","","","","","}","{}","{\"id\": \"parttypeA_1\",\"time\": 0,\"property\": \"place\",\"value1\": \"enter\",\"value2\": \"B1\"},{\"id\": \"parttypeA_1\",\"time\": 1,\"property\": \"place\",\"value1\": \"exit\",\"value2\": \"B1\"},{\"id\": \"parttypeA_1\",\"time\": 1,1,\"property\": \"place\",\"value1\": \"enter\",\"value2\": \"M1\"},{\"id\": \"parttypeA_1\",\"time\": 2,\"property\": \"place\",\"value1\": \"exit\",\"value2\": \"M1\"},{\"id\": \"parttypeA_1\",\"time\": 2,\"property\": \"place\",\"value1\": \"enter\",\"value2\": \"B3\"},{\"id\": \"parttypeA_1\",\"time\": 3,\"property\": \"place\",\"value1\": \"exit\",\"value2\": \"B3\"},{\"id\": \"parttypeA_1\",\"time\": 3,\"property\": \"place\",\"value1\": \"enter\",\"value2\": \"M2\"},{\"id\": \"parttypeA_1\",\"time\": 4,\"property\": \"place\",\"value1\": \"exit\",\"value2\": \"M2\"},{\"id\": \"parttypeA_1\",\"time\": 4,\"property\": \"place\",\"value1\": \"enter\",\"value2\": \"B5\"},{\"id\": \"parttypeA_1\",\"time\": 5,1,\"property\": \"place\",\"value1\": \"exit\",\"value2\": \"B5\"},{\"id\": \"parttypeA_2\",\"time\": 1,\"property\": \"place\",\"value1\": \"enter\",\"value2\": \"B1\"},{\"id\": \"parttypeA_3\",\"time\": 1,5,\"property\": \"place\",\"value1\": \"enter\",\"value2\": \"B1\"},{\"id\": \"parttypeA_4\",\"time\": 2,5,\"property\": \"place\",\"value1\": \"enter\",\"value2\": \"B1\"},{},{},{},{}",null,",,,,","id,time,property,value1,value2,parttypeA_1,0,place,enter,B1,parttypeA_1,1,place,exit,B1,parttypeA_1,1,1,place,enter,M1,parttypeA_1,2,place,exit,M1,parttypeA_1,2,place,enter,B3,parttypeA_1,3,place,exit,B3,parttypeA_1,3,place,enter,M2,parttypeA_1,4,place,exit,M2,parttypeA_1,4,place,enter,B5,parttypeA_1,5,1,place,exit,B5,parttypeA_2,1,place,enter,B1,parttypeA_3,1,5,place,enter,B1,parttypeA_4,2,5,place,enter,B1,,,,,,,,,,,,,,,,,,,,"]
[null,null,null,null,null,null,null,"{","","","","","","}","{}","{\"id\": \"parttypeA_1\",\"time\": 0,\"property\": \"place\",\"value1\": \"enter\",\"value2\": \"B1\"},{\"id\": \"parttypeA_1\",\"time\": 1,\"property\": \"place\",\"value1\": \"exit\",\"value2\": \"B1\"},{\"id\": \"parttypeA_1\",\"time\": 1,1,\"property\": \"place\",\"value1\": \"enter\",\"value2\": \"M1\"},{\"id\": \"parttypeA_1\",\"time\": 2,\"property\": \"place\",\"value1\": \"exit\",\"value2\": \"M1\"},{\"id\": \"parttypeA_1\",\"time\": 2,\"property\": \"place\",\"value1\": \"enter\",\"value2\": \"B3\"},{\"id\": \"parttypeA_1\",\"time\": 3,\"property\": \"place\",\"value1\": \"exit\",\"value2\": \"B3\"},{\"id\": \"parttypeA_1\",\"time\": 3,\"property\": \"place\",\"value1\": \"enter\",\"value2\": \"M2\"},{\"id\": \"parttypeA_1\",\"time\": 4,\"property\": \"place\",\"value1\": \"exit\",\"value2\": \"M2\"},{\"id\": \"parttypeA_1\",\"time\": 4,\"property\": \"place\",\"value1\": \"enter\",\"value2\": \"B5\"},{\"id\": \"parttypeA_1\",\"time\": 5,1,\"property\": \"place\",\"value1\": \"exit\",\"value2\": \"B5\"},{\"id\": \"parttypeA_2\",\"time\": 1,\"property\": \"place\",\"value1\": \"enter\",\"value2\": \"B1\"},{\"id\": \"parttypeA_3\",\"time\": 1,5,\"property\": \"place\",\"value1\": \"enter\",\"value2\": \"B1\"},{\"id\": \"parttypeA_4\",\"time\": 2,5,\"property\": \"place\",\"value1\": \"enter\",\"value2\": \"B1\"},{},{},{},{},{}",null,",,,,","id,time,property,value1,value2,parttypeA_1,0,place,enter,B1,parttypeA_1,1,place,exit,B1,parttypeA_1,1,1,place,enter,M1,parttypeA_1,2,place,exit,M1,parttypeA_1,2,place,enter,B3,parttypeA_1,3,place,exit,B3,parttypeA_1,3,place,enter,M2,parttypeA_1,4,place,exit,M2,parttypeA_1,4,place,enter,B5,parttypeA_1,5,1,place,exit,B5,parttypeA_2,1,place,enter,B1,parttypeA_3,1,5,place,enter,B1,parttypeA_4,2,5,place,enter,B1,,,,,,,,,,,,,,,,,,,,,,,,,"]
[null,null,null,null,null,null,null,"{","","","","","","}","{}","{\"id\": \"parttypeA_1\",\"time\": 0,\"property\": \"place\",\"value1\": \"enter\",\"value2\": \"B1\"},{\"id\": \"parttypeA_1\",\"time\": 1,\"property\": \"place\",\"value1\": \"exit\",\"value2\": \"B1\"},{\"id\": \"parttypeA_1\",\"time\": 1,1,\"property\": \"place\",\"value1\": \"enter\",\"value2\": \"M1\"},{\"id\": \"parttypeA_1\",\"time\": 2,\"property\": \"place\",\"value1\": \"exit\",\"value2\": \"M1\"},{\"id\": \"parttypeA_1\",\"time\": 2,\"property\": \"place\",\"value1\": \"enter\",\"value2\": \"B3\"},{\"id\": \"parttypeA_1\",\"time\": 3,\"property\": \"place\",\"value1\": \"exit\",\"value2\": \"B3\"},{\"id\": \"parttypeA_1\",\"time\": 3,\"property\": \"place\",\"value1\": \"enter\",\"value2\": \"M2\"},{\"id\": \"parttypeA_1\",\"time\": 4,\"property\": \"place\",\"value1\": \"exit\",\"value2\": \"M2\"},{\"id\": \"parttypeA_1\",\"time\": 4,\"property\": \"place\",\"value1\": \"enter\",\"value2\": \"B5\"},{\"id\": \"parttypeA_1\",\"time\": 5,1,\"property\": \"place\",\"value1\": \"exit\",\"value2\": \"B5\"},{\"id\": \"parttypeA_2\",\"time\": 1,\"property\": \"place\",\"value1\": \"enter\",\"value2\": \"B1\"},{\"id\": \"parttypeA_3\",\"time\": 1,5,\"property\": \"place\",\"value1\": \"enter\",\"value2\": \"B1\"},{\"id\": \"parttypeA_4\",\"time\": 2,5,\"property\": \"place\",\"value1\": \"enter\",\"value2\": \"B1\"},{},{},{},{},{},{}",null,",,,,","id,time,property,value1,value2,parttypeA_1,0,place,enter,B1,parttypeA_1,1,place,exit,B1,parttypeA_1,1,1,place,enter,M1,parttypeA_1,2,place,exit,M1,parttypeA_1,2,place,enter,B3,parttypeA_1,3,place,exit,B3,parttypeA_1,3,place,enter,M2,parttypeA_1,4,place,exit,M2,parttypeA_1,4,place,enter,B5,parttypeA_1,5,1,place,exit,B5,parttypeA_2,1,place,enter,B1,parttypeA_3,1,5,place,enter,B1,parttypeA_4,2,5,place,enter,B1,,,,,,,,,,,,,,,,,,,,,,,,,,,,,,"]
[null,null,null,null,null,null,null,"{","","","","","","}","{}","{\"id\": \"parttypeA_1\",\"time\": 0,\"property\": \"place\",\"value1\": \"enter\",\"value2\": \"B1\"},{\"id\": \"parttypeA_1\",\"time\": 1,\"property\": \"place\",\"value1\": \"exit\",\"value2\": \"B1\"},{\"id\": \"parttypeA_1\",\"time\": 1,1,\"property\": \"place\",\"value1\": \"enter\",\"value2\": \"M1\"},{\"id\": \"parttypeA_1\",\"time\": 2,\"property\": \"place\",\"value1\": \"exit\",\"value2\": \"M1\"},{\"id\": \"parttypeA_1\",\"time\": 2,\"property\": \"place\",\"value1\": \"enter\",\"value2\": \"B3\"},{\"id\": \"parttypeA_1\",\"time\": 3,\"property\": \"place\",\"value1\": \"exit\",\"value2\": \"B3\"},{\"id\": \"parttypeA_1\",\"time\": 3,\"property\": \"place\",\"value1\": \"enter\",\"value2\": \"M2\"},{\"id\": \"parttypeA_1\",\"time\": 4,\"property\": \"place\",\"value1\": \"exit\",\"value2\": \"M2\"},{\"id\": \"parttypeA_1\",\"time\": 4,\"property\": \"place\",\"value1\": \"enter\",\"value2\": \"B5\"},{\"id\": \"parttypeA_1\",\"time\": 5,1,\"property\": \"place\",\"value1\": \"exit\",\"value2\": \"B5\"},{\"id\": \"parttypeA_2\",\"time\": 1,\"property\": \"place\",\"value1\": \"enter\",\"value2\": \"B1\"},{\"id\": \"parttypeA_3\",\"time\": 1,5,\"property\": \"place\",\"value1\": \"enter\",\"value2\": \"B1\"},{\"id\": \"parttypeA_4\",\"time\": 2,5,\"property\": \"place\",\"value1\": \"enter\",\"value2\": \"B1\"},{},{},{},{},{},{},{}",null,",,,,","id,time,property,value1,value2,parttypeA_1,0,place,enter,B1,parttypeA_1,1,place,exit,B1,parttypeA_1,1,1,place,enter,M1,parttypeA_1,2,place,exit,M1,parttypeA_1,2,place,enter,B3,parttypeA_1,3,place,exit,B3,parttypeA_1,3,place,enter,M2,parttypeA_1,4,place,exit,M2,parttypeA_1,4,place,enter,B5,parttypeA_1,5,1,place,exit,B5,parttypeA_2,1,place,enter,B1,parttypeA_3,1,5,place,enter,B1,parttypeA_4,2,5,place,enter,B1,,,,,,,,,,,,,,,,,,,,,,,,,,,,,,,,,,,"]
[null,null,null,null,null,null,null,"{","","","","","","}","{}","{\"id\": \"parttypeA_1\",\"time\": 0,\"property\": \"place\",\"value1\": \"enter\",\"value2\": \"B1\"},{\"id\": \"parttypeA_1\",\"time\": 1,\"property\": \"place\",\"value1\": \"exit\",\"value2\": \"B1\"},{\"id\": \"parttypeA_1\",\"time\": 1,1,\"property\": \"place\",\"value1\": \"enter\",\"value2\": \"M1\"},{\"id\": \"parttypeA_1\",\"time\": 2,\"property\": \"place\",\"value1\": \"exit\",\"value2\": \"M1\"},{\"id\": \"parttypeA_1\",\"time\": 2,\"property\": \"place\",\"value1\": \"enter\",\"value2\": \"B3\"},{\"id\": \"parttypeA_1\",\"time\": 3,\"property\": \"place\",\"value1\": \"exit\",\"value2\": \"B3\"},{\"id\": \"parttypeA_1\",\"time\": 3,\"property\": \"place\",\"value1\": \"enter\",\"value2\": \"M2\"},{\"id\": \"parttypeA_1\",\"time\": 4,\"property\": \"place\",\"value1\": \"exit\",\"value2\": \"M2\"},{\"id\": \"parttypeA_1\",\"time\": 4,\"property\": \"place\",\"value1\": \"enter\",\"value2\": \"B5\"},{\"id\": \"parttypeA_1\",\"time\": 5,1,\"property\": \"place\",\"value1\": \"exit\",\"value2\": \"B5\"},{\"id\": \"parttypeA_2\",\"time\": 1,\"property\": \"place\",\"value1\": \"enter\",\"value2\": \"B1\"},{\"id\": \"parttypeA_3\",\"time\": 1,5,\"property\": \"place\",\"value1\": \"enter\",\"value2\": \"B1\"},{\"id\": \"parttypeA_4\",\"time\": 2,5,\"property\": \"place\",\"value1\": \"enter\",\"value2\": \"B1\"},{},{},{},{},{},{},{},{}",null,",,,,","id,time,property,value1,value2,parttypeA_1,0,place,enter,B1,parttypeA_1,1,place,exit,B1,parttypeA_1,1,1,place,enter,M1,parttypeA_1,2,place,exit,M1,parttypeA_1,2,place,enter,B3,parttypeA_1,3,place,exit,B3,parttypeA_1,3,place,enter,M2,parttypeA_1,4,place,exit,M2,parttypeA_1,4,place,enter,B5,parttypeA_1,5,1,place,exit,B5,parttypeA_2,1,place,enter,B1,parttypeA_3,1,5,place,enter,B1,parttypeA_4,2,5,place,enter,B1,,,,,,,,,,,,,,,,,,,,,,,,,,,,,,,,,,,,,,,,"]
[null,null,null,null,null,null,null,"{","","","","","","}","{}","{\"id\": \"parttypeA_1\",\"time\": 0,\"property\": \"place\",\"value1\": \"enter\",\"value2\": \"B1\"},{\"id\": \"parttypeA_1\",\"time\": 1,\"property\": \"place\",\"value1\": \"exit\",\"value2\": \"B1\"},{\"id\": \"parttypeA_1\",\"time\": 1,1,\"property\": \"place\",\"value1\": \"enter\",\"value2\": \"M1\"},{\"id\": \"parttypeA_1\",\"time\": 2,\"property\": \"place\",\"value1\": \"exit\",\"value2\": \"M1\"},{\"id\": \"parttypeA_1\",\"time\": 2,\"property\": \"place\",\"value1\": \"enter\",\"value2\": \"B3\"},{\"id\": \"parttypeA_1\",\"time\": 3,\"property\": \"place\",\"value1\": \"exit\",\"value2\": \"B3\"},{\"id\": \"parttypeA_1\",\"time\": 3,\"property\": \"place\",\"value1\": \"enter\",\"value2\": \"M2\"},{\"id\": \"parttypeA_1\",\"time\": 4,\"property\": \"place\",\"value1\": \"exit\",\"value2\": \"M2\"},{\"id\": \"parttypeA_1\",\"time\": 4,\"property\": \"place\",\"value1\": \"enter\",\"value2\": \"B5\"},{\"id\": \"parttypeA_1\",\"time\": 5,1,\"property\": \"place\",\"value1\": \"exit\",\"value2\": \"B5\"},{\"id\": \"parttypeA_2\",\"time\": 1,\"property\": \"place\",\"value1\": \"enter\",\"value2\": \"B1\"},{\"id\": \"parttypeA_3\",\"time\": 1,5,\"property\": \"place\",\"value1\": \"enter\",\"value2\": \"B1\"},{\"id\": \"parttypeA_4\",\"time\": 2,5,\"property\": \"place\",\"value1\": \"enter\",\"value2\": \"B1\"},{},{},{},{},{},{},{},{},{}",null,",,,,","id,time,property,value1,value2,parttypeA_1,0,place,enter,B1,parttypeA_1,1,place,exit,B1,parttypeA_1,1,1,place,enter,M1,parttypeA_1,2,place,exit,M1,parttypeA_1,2,place,enter,B3,parttypeA_1,3,place,exit,B3,parttypeA_1,3,place,enter,M2,parttypeA_1,4,place,exit,M2,parttypeA_1,4,place,enter,B5,parttypeA_1,5,1,place,exit,B5,parttypeA_2,1,place,enter,B1,parttypeA_3,1,5,place,enter,B1,parttypeA_4,2,5,place,enter,B1,,,,,,,,,,,,,,,,,,,,,,,,,,,,,,,,,,,,,,,,,,,,,"]
[null,null,null,null,null,null,null,"{","","","","","","}","{}","{\"id\": \"parttypeA_1\",\"time\": 0,\"property\": \"place\",\"value1\": \"enter\",\"value2\": \"B1\"},{\"id\": \"parttypeA_1\",\"time\": 1,\"property\": \"place\",\"value1\": \"exit\",\"value2\": \"B1\"},{\"id\": \"parttypeA_1\",\"time\": 1,1,\"property\": \"place\",\"value1\": \"enter\",\"value2\": \"M1\"},{\"id\": \"parttypeA_1\",\"time\": 2,\"property\": \"place\",\"value1\": \"exit\",\"value2\": \"M1\"},{\"id\": \"parttypeA_1\",\"time\": 2,\"property\": \"place\",\"value1\": \"enter\",\"value2\": \"B3\"},{\"id\": \"parttypeA_1\",\"time\": 3,\"property\": \"place\",\"value1\": \"exit\",\"value2\": \"B3\"},{\"id\": \"parttypeA_1\",\"time\": 3,\"property\": \"place\",\"value1\": \"enter\",\"value2\": \"M2\"},{\"id\": \"parttypeA_1\",\"time\": 4,\"property\": \"place\",\"value1\": \"exit\",\"value2\": \"M2\"},{\"id\": \"parttypeA_1\",\"time\": 4,\"property\": \"place\",\"value1\": \"enter\",\"value2\": \"B5\"},{\"id\": \"parttypeA_1\",\"time\": 5,1,\"property\": \"place\",\"value1\": \"exit\",\"value2\": \"B5\"},{\"id\": \"parttypeA_2\",\"time\": 1,\"property\": \"place\",\"value1\": \"enter\",\"value2\": \"B1\"},{\"id\": \"parttypeA_3\",\"time\": 1,5,\"property\": \"place\",\"value1\": \"enter\",\"value2\": \"B1\"},{\"id\": \"parttypeA_4\",\"time\": 2,5,\"property\": \"place\",\"value1\": \"enter\",\"value2\": \"B1\"},{},{},{},{},{},{},{},{},{},{}",null,",,,,","id,time,property,value1,value2,parttypeA_1,0,place,enter,B1,parttypeA_1,1,place,exit,B1,parttypeA_1,1,1,place,enter,M1,parttypeA_1,2,place,exit,M1,parttypeA_1,2,place,enter,B3,parttypeA_1,3,place,exit,B3,parttypeA_1,3,place,enter,M2,parttypeA_1,4,place,exit,M2,parttypeA_1,4,place,enter,B5,parttypeA_1,5,1,place,exit,B5,parttypeA_2,1,place,enter,B1,parttypeA_3,1,5,place,enter,B1,parttypeA_4,2,5,place,enter,B1,,,,,,,,,,,,,,,,,,,,,,,,,,,,,,,,,,,,,,,,,,,,,,,,,,"]
[null,null,null,null,null,null,null,"{","","","","","","}","{}","{\"id\": \"parttypeA_1\",\"time\": 0,\"property\": \"place\",\"value1\": \"enter\",\"value2\": \"B1\"},{\"id\": \"parttypeA_1\",\"time\": 1,\"property\": \"place\",\"value1\": \"exit\",\"value2\": \"B1\"},{\"id\": \"parttypeA_1\",\"time\": 1,1,\"property\": \"place\",\"value1\": \"enter\",\"value2\": \"M1\"},{\"id\": \"parttypeA_1\",\"time\": 2,\"property\": \"place\",\"value1\": \"exit\",\"value2\": \"M1\"},{\"id\": \"parttypeA_1\",\"time\": 2,\"property\": \"place\",\"value1\": \"enter\",\"value2\": \"B3\"},{\"id\": \"parttypeA_1\",\"time\": 3,\"property\": \"place\",\"value1\": \"exit\",\"value2\": \"B3\"},{\"id\": \"parttypeA_1\",\"time\": 3,\"property\": \"place\",\"value1\": \"enter\",\"value2\": \"M2\"},{\"id\": \"parttypeA_1\",\"time\": 4,\"property\": \"place\",\"value1\": \"exit\",\"value2\": \"M2\"},{\"id\": \"parttypeA_1\",\"time\": 4,\"property\": \"place\",\"value1\": \"enter\",\"value2\": \"B5\"},{\"id\": \"parttypeA_1\",\"time\": 5,1,\"property\": \"place\",\"value1\": \"exit\",\"value2\": \"B5\"},{\"id\": \"parttypeA_2\",\"time\": 1,\"property\": \"place\",\"value1\": \"enter\",\"value2\": \"B1\"},{\"id\": \"parttypeA_3\",\"time\": 1,5,\"property\": \"place\",\"value1\": \"enter\",\"value2\": \"B1\"},{\"id\": \"parttypeA_4\",\"time\": 2,5,\"property\": \"place\",\"value1\": \"enter\",\"value2\": \"B1\"},{},{},{},{},{},{},{},{},{},{},{}",null,",,,,","id,time,property,value1,value2,parttypeA_1,0,place,enter,B1,parttypeA_1,1,place,exit,B1,parttypeA_1,1,1,place,enter,M1,parttypeA_1,2,place,exit,M1,parttypeA_1,2,place,enter,B3,parttypeA_1,3,place,exit,B3,parttypeA_1,3,place,enter,M2,parttypeA_1,4,place,exit,M2,parttypeA_1,4,place,enter,B5,parttypeA_1,5,1,place,exit,B5,parttypeA_2,1,place,enter,B1,parttypeA_3,1,5,place,enter,B1,parttypeA_4,2,5,place,enter,B1,,,,,,,,,,,,,,,,,,,,,,,,,,,,,,,,,,,,,,,,,,,,,,,,,,,,,,,"]
[null,null,null,null,null,null,null,"{","","","","","","}","{}","{\"id\": \"parttypeA_1\",\"time\": 0,\"property\": \"place\",\"value1\": \"enter\",\"value2\": \"B1\"},{\"id\": \"parttypeA_1\",\"time\": 1,\"property\": \"place\",\"value1\": \"exit\",\"value2\": \"B1\"},{\"id\": \"parttypeA_1\",\"time\": 1,1,\"property\": \"place\",\"value1\": \"enter\",\"value2\": \"M1\"},{\"id\": \"parttypeA_1\",\"time\": 2,\"property\": \"place\",\"value1\": \"exit\",\"value2\": \"M1\"},{\"id\": \"parttypeA_1\",\"time\": 2,\"property\": \"place\",\"value1\": \"enter\",\"value2\": \"B3\"},{\"id\": \"parttypeA_1\",\"time\": 3,\"property\": \"place\",\"value1\": \"exit\",\"value2\": \"B3\"},{\"id\": \"parttypeA_1\",\"time\": 3,\"property\": \"place\",\"value1\": \"enter\",\"value2\": \"M2\"},{\"id\": \"parttypeA_1\",\"time\": 4,\"property\": \"place\",\"value1\": \"exit\",\"value2\": \"M2\"},{\"id\": \"parttypeA_1\",\"time\": 4,\"property\": \"place\",\"value1\": \"enter\",\"value2\": \"B5\"},{\"id\": \"parttypeA_1\",\"time\": 5,1,\"property\": \"place\",\"value1\": \"exit\",\"value2\": \"B5\"},{\"id\": \"parttypeA_2\",\"time\": 1,\"property\": \"place\",\"value1\": \"enter\",\"value2\": \"B1\"},{\"id\": \"parttypeA_3\",\"time\": 1,5,\"property\": \"place\",\"value1\": \"enter\",\"value2\": \"B1\"},{\"id\": \"parttypeA_4\",\"time\": 2,5,\"property\": \"place\",\"value1\": \"enter\",\"value2\": \"B1\"},{},{},{},{},{},{},{},{},{},{},{},{}",null,",,,,","id,time,property,value1,value2,parttypeA_1,0,place,enter,B1,parttypeA_1,1,place,exit,B1,parttypeA_1,1,1,place,enter,M1,parttypeA_1,2,place,exit,M1,parttypeA_1,2,place,enter,B3,parttypeA_1,3,place,exit,B3,parttypeA_1,3,place,enter,M2,parttypeA_1,4,place,exit,M2,parttypeA_1,4,place,enter,B5,parttypeA_1,5,1,place,exit,B5,parttypeA_2,1,place,enter,B1,parttypeA_3,1,5,place,enter,B1,parttypeA_4,2,5,place,enter,B1,,,,,,,,,,,,,,,,,,,,,,,,,,,,,,,,,,,,,,,,,,,,,,,,,,,,,,,,,,,,"]
[null,null,null,null,null,null,null,"{","","","","","","}","{}","{\"id\": \"parttypeA_1\",\"time\": 0,\"property\": \"place\",\"value1\": \"enter\",\"value2\": \"B1\"},{\"id\": \"parttypeA_1\",\"time\": 1,\"property\": \"place\",\"value1\": \"exit\",\"value2\": \"B1\"},{\"id\": \"parttypeA_1\",\"time\": 1,1,\"property\": \"place\",\"value1\": \"enter\",\"value2\": \"M1\"},{\"id\": \"parttypeA_1\",\"time\": 2,\"property\": \"place\",\"value1\": \"exit\",\"value2\": \"M1\"},{\"id\": \"parttypeA_1\",\"time\": 2,\"property\": \"place\",\"value1\": \"enter\",\"value2\": \"B3\"},{\"id\": \"parttypeA_1\",\"time\": 3,\"property\": \"place\",\"value1\": \"exit\",\"value2\": \"B3\"},{\"id\": \"parttypeA_1\",\"time\": 3,\"property\": \"place\",\"value1\": \"enter\",\"value2\": \"M2\"},{\"id\": \"parttypeA_1\",\"time\": 4,\"property\": \"place\",\"value1\": \"exit\",\"value2\": \"M2\"},{\"id\": \"parttypeA_1\",\"time\": 4,\"property\": \"place\",\"value1\": \"enter\",\"value2\": \"B5\"},{\"id\": \"parttypeA_1\",\"time\": 5,1,\"property\": \"place\",\"value1\": \"exit\",\"value2\": \"B5\"},{\"id\": \"parttypeA_2\",\"time\": 1,\"property\": \"place\",\"value1\": \"enter\",\"value2\": \"B1\"},{\"id\": \"parttypeA_3\",\"time\": 1,5,\"property\": \"place\",\"value1\": \"enter\",\"value2\": \"B1\"},{\"id\": \"parttypeA_4\",\"time\": 2,5,\"property\": \"place\",\"value1\": \"enter\",\"value2\": \"B1\"},{},{},{},{},{},{},{},{},{},{},{},{},{}",null,",,,,","id,time,property,value1,value2,parttypeA_1,0,place,enter,B1,parttypeA_1,1,place,exit,B1,parttypeA_1,1,1,place,enter,M1,parttypeA_1,2,place,exit,M1,parttypeA_1,2,place,enter,B3,parttypeA_1,3,place,exit,B3,parttypeA_1,3,place,enter,M2,parttypeA_1,4,place,exit,M2,parttypeA_1,4,place,enter,B5,parttypeA_1,5,1,place,exit,B5,parttypeA_2,1,place,enter,B1,parttypeA_3,1,5,place,enter,B1,parttypeA_4,2,5,place,enter,B1,,,,,,,,,,,,,,,,,,,,,,,,,,,,,,,,,,,,,,,,,,,,,,,,,,,,,,,,,,,,,,,,,"]